{"text_format":"1","workbook":"xlsx","n_sheets":30,"sheets":["Accueil","socio","TestsAN","TestsBN","Facteurs","RAADS","GraphTCA","Incidence","Courbe In","GraphIMC","Courbe IMC","Synthèse","recueil","Archive1","Archive2","Archive3","Archive4","Archive5","listes","IMC d'équilibre","crises","Genogramme","SilhouettesF","SilhouettesH","SilhFilles","SilhGarcons","Feuil1","Saisie Pds","IDC","Graph IDC"],"not_rendered":{"charts":7,"images":13,"macros":1,"external_links":0,"defined_names":5,"comments":0,"pivot_tables":0},"unopened":[],"bounds":{"document_bytes":16777216,"sheet_cells":100000,"rows_first":2000,"rows_last":500,"rows_between":2000,"halvings":0,"cell_chars":16384,"cell_head_chars":4096},"cells_cut":0,"cells_raw":0,"read":"whole","date_system":"1900"}

{"sheet":"Accueil","index":0,"n_rows":44,"n_cols":21,"rows_kept":44,"cut":false,"hidden":false,"merged":[[19,17,20,18],[25,17,26,18],[26,10,26,13],[20,10,20,13],[23,10,23,13],[25,11,25,13],[22,17,23,18],[22,11,22,13],[19,11,19,13],[1,10,2,18],[13,17,14,18],[16,17,17,18],[7,1,8,1],[17,10,17,13],[9,10,9,12],[10,10,10,12],[16,11,16,13],[13,11,13,13],[14,10,14,13]]}
["1900-01-01"]
[null,"Date initiale",null,null,"Poids ",null,"Taille",null,null,null,"F 50"]
[null,{"$f":"TODAY()","v":"2021-01-17"},{"$f":"IF(D3=0,FIND(\".\",E3),0)","v":{"$error":"#VALUE!"}},{"$f":"IF(ISNUMBER(E3),1,0)","v":0},null," kg",null,"m"]
[null,"modifier si nécessaire",null,{"$f":"IF(ISNUMBER(G3),1,0)","v":0}]
[]
[]
[null,"Code ou identifiant",null,null,null,null,null,null,null,null,null,null,null,null,null,null,null,null,null,null,{"$f":"INFO(\"SYSTEM\")","v":"pcdos"}]
[null," ",null,null,null,null,null,null,null,null,null,null,null,null,null,null,null,null,null,null,{"$f":"IF(LEFT(U7,1)=\"p\",1,0)","v":1}]
[]
[]
[]
[null,"Date de naissance"]
[null,null,null,null,null,null,null,null,null,null," Dates de passation des questionnaires et diagnostics probables"]
[null,"xx/xx/xx",null,null,null,null,null,null,null,null,null,null,null,null,null,null,{"$f":"IF(Archive1!$C$51=\"\",\"\",\"è \")","v":""},{"$f":"IF(Archive1!$C$51=\"\",\"\",Archive1!$C$51)","v":""}]
[null,{"$f":"YEAR(B3)-YEAR(B13)","v":121}]
[null,"Sexe"]
[null,null,null,null,null,null,null,null,null,null,null,null,null,null,null,null,{"$f":"IF(Archive2!C51=\"\",\"\",\"è \")","v":""},{"$f":"IF(Archive2!$C$51=\"\",\"\",Archive2!$C$51)","v":""}]
[]
[null,"Diagnostic Principal"]
[null,null,null,null,null,null,null,null,null,null,null,null,null,null,null,null,{"$f":"IF(Archive3!C51=\"\",\"\",\"è \")","v":""},{"$f":"IF(Archive3!$C$51=\"\",\"\",Archive3!$C$51)","v":""}]
[]
[]
[null,"Dépense énergétique de repos",null,null,null,null,null,null,null,null,null,null,null,null,null,null,{"$f":"IF(Archive4!C51=\"\",\"\",\"è \")","v":""},{"$f":"IF(Archive4!C$51=\"\",\"\",Archive4!C$51)","v":""}]
[null,{"$f":"IF(E3*G3=0,\"\",IF(recueil!E5=1,ROUND(B26,0),ROUND(B27,0)) & \" Kcal\")","v":""}]
[null,"Formule de Harris-Benedict"]
[null,{"$f":"IF(recueil!E$6=\"\",\"\",(9.5634*E$3)+(184.96*G$3)-4.6756*B$15)+655.1","v":89.352399999999989},null,null,null,null,null,null,null,null,null,null,null,null,null,null,{"$f":"IF(Archive5!C51=\"\",\"\",\"è \")","v":""},{"$f":"IF(Archive5!C$51=\"\",\"\",Archive5!C$51)","v":""}]
[null,{"$f":"IF(recueil!E$6=\"\",\"\",(13.7516*E$3)+(500.33*G$3)-6.755*B$15)+66.473","v":-750.88200000000006}]
[]
[]
[]
[]
[]
[null,{"$f":"NOW()","v":"2021-01-17T16:05:21.520"}]
[null,{"$f":"(_xlfn.DAYS(B33,B13))/365","v":121.13150684931507}]
[]
[]
[]
[]
[]
[]
[]
[]
[]
[null,{"$f":"IF(B13=\"\",0,(B3-B13)/365)","v":0}]

{"sheet":"socio","index":1,"n_rows":83,"n_cols":8,"rows_kept":83,"cut":false,"hidden":false,"merged":[[11,6,12,6],[0,0,0,2],[66,2,66,3],[72,1,79,1],[72,2,79,2],[72,3,79,3],[72,4,79,4],[82,1,89,1],[67,2,67,3],[68,2,68,3],[69,2,69,3],[15,3,15,4]]}
["Questionnaire Socio-démographique"]
[]
["Langue maternelle ( langue dans laquelle a été effectuée la majorité de la scolarité)"]
[" "]
["Comment vous financez-vous ?",null,"Vous habitez :"]
[]
["État civil",null,"Famille :","Parents","nbre de frères","nbre de soeurs"]
[null,null,null,null,0,0]
[]
["Etudes :","Niveau atteint","  Professions :","père",null,"mère"]
[]
[null,null,null,null,null,"vous","votre profession ou celle que vous envisagez de faire"]
[]
[]
[" Histoire Thérapeutique"]
[]
["Hospitalisations antérieures pour le même trouble (nombre)",null,null,null,"Durée cumulée:","mois"]
[]
["Psychothérapie(s) antérieures éventuelles",null,"Type","Durée"]
[1,null,null,"mois     "]
[2,null,null,"mois     "]
[3,null,null,"mois     "]
["Psychothérapie en cours",null,"Type","Durée"]
[null,null,null,"mois     "]
[]
["Génogramme",null,null,"Eventuellement",null,null,null,"Eventuellement"]
[null,null,"Année de naissance","Année de décès","Antécédents ",null,"Année de naissance","Année de décès"]
["Grands parents","Grand-mère",null,null,null,"Grand-père"]
["maternels","GMM",null,null,null,"GPM"]
[]
[]
[]
[]
["Grands parents","Grand-mère",null,null,null,"Grand-père"]
["paternels","GMP",null,null,null,"GPP"]
[]
[]
[]
[]
["Parents","Mère",null,null,null,"Père"]
[]
[]
[]
[]
[]
["Fratrie",{"$f":"IF($E$8=0,\"NC\",\"Frère 1\")","v":"NC"},null,null,null,{"$f":"IF($F$8=0,\"NC\",\"Sœur 1\")","v":"NC"}]
[]
[]
[null,{"$f":"IF(E8<2,\"\",\"Frère 2\")","v":""},null,null,null,{"$f":"IF($F$8<2,\"\",\"Sœur 2\")","v":""}]
[]
[]
[null,{"$f":"IF(E8<3,\"\",\"Frère 3\")","v":""},null,null,null,{"$f":"IF($F$8<3,\"\",\"Sœur 3\")","v":""}]
[]
[]
[null,{"$f":"IF($E$8<4,\"\",\"Frère 4\")","v":""},null,null,null,{"$f":"IF($F$8<4,\"\",\"Sœur 4\")","v":""}]
[]
[]
[null,{"$f":"IF($E$8<5,\"\",\"Frère 5\")","v":""},null,null,null,{"$f":"IF($F$8<5,\"\",\"Sœur 5\")","v":""}]
[]
[]
[null,{"$f":"IF($E$8<6,\"\",\"Frère 6\")","v":""},null,null,null,{"$f":"IF($F$8<6,\"\",\"Sœur 6\")","v":""}]
[]
[]
["Données médicales"]
[]
[null,"Nom","Adresse"]
["Médecin (MG)"]
["Psychiatre"]
["Psychothérapeute"]
["Coach"]
[]
[null,"Médicaux","Chirurgicaux","Psy","Allergies"]
["Antécédents"]
[]
[]
[]
[]
[]
[]
[]
[]
[]
["Traitement actuel"]

{"sheet":"TestsAN","index":2,"n_rows":36,"n_cols":4,"rows_kept":36,"cut":false,"hidden":false,"merged":[[2,0,2,1],[0,0,1,1],[3,1,5,1],[3,2,3,3],[5,2,5,3],[2,2,2,3]]}
["Questionnaire d'évaluation de l'anorexie"]
[]
["Instructions",null,"Pour information"]
[null,"Vous trouverez ci-dessous une série de questions permettant de préciser le diagnostic  et l'intensité du trouble des conduites alimentaires dont vous souffrez. Il évalue aussi son   impact sur votre vie quotidienne. Choisissez la réponse vous paraissant la plus adaptée  pour la période des 15 derniers jours.","Votre poids minimum normal est proche de :"]
[null,null,{"$f":"IF(ISBLANK(Accueil!$B$8),\"\",'Courbe In'!$B$10)","v":{"$error":"#VALUE!"}},"kg"]
[null,null,"Valeur seuil de l'anorexie pour vous :"]
[null,null,{"$f":"IF(ISBLANK(Accueil!$B$8),\"\",'Courbe In'!$B$11)","v":""},"kg"]
[null,"Évaluation diagnostique"]
[1,"Votre poids actuel est-il égal ou inférieur à la valeur seuil de l'anorexie (Cf. encadré ci-dessus) ?"]
[2,"Avez-vous le désir de maintenir votre poids en dessous de sa valeur minimale normale (Cf. encadré ci-dessus) ?"]
[3,"Faites-vous, ou avez-vous fait dans le passé, beaucoup d'efforts pour perdre du poids ou ne pas en prendre ?"]
[4,"Vous arrive-t-il de recourir à des vomissements pour ne pas prendre de poids ?"]
[5,"Vous arrive-t-il de recourir à des laxatifs pour ne pas prendre de poids ?"]
[6,"Vous arrive-t-il de recourir à des diurétiques pour ne pas prendre de poids ?"]
[7,"Avez-vous tendance à réduire le nombre de repas pris chaque jour ?"]
[8,"Evitez-vous de manger certains aliments systématiquement ?"]
[9,"Faites-vous du sport ou des exercices physiques pour contrôler votre poids ?"]
[null,"Évaluation de l'incidence des troubles"]
[10,"Quel est l'impact du trouble sur l'état de vos cheveux, votre peau et/ou vos ongles ?"]
[11,"Quel est l'impact sur votre tube digestif (douleur, constipation, diarrhées, etc.) ?"]
[12,"Quel est l'impact sur votre sensation de fatigue physique ?"]
[13,"Quel est l'impact sur votre sexualité ?"]
[14,"Ce trouble alimentaire affecte-t-il votre moral ?"]
[15,"Ce trouble alimentaire a-t-il augmenté votre niveau d'anxiété ?"]
[16,"Ce trouble a-t-il un effet négatif sur votre estime personnelle ?"]
[17,"Ce trouble vous rend-t-il irritable?"]
[18,"Ce trouble altère-t-il votre capacité à vous concentrer dans vos activités?"]
[19,"Votre sommeil en est-il perturbé?"]
[20,"A cause de ce trouble, vous arrive-t-il de prendre de l'alcool, des drogues ou des médicaments non prescrits?"]
[21,"Ce trouble vous empêche-t-il de travailler?"]
[22,"Ce trouble vous empêche-t-il de poursuivre des activités qui vous plaisaient avant ?"]
[23,"Ce trouble nuit-il à vos relations avec les membres de votre famille (parents, enfants ou proches)?"]
[24,"Ce trouble nuit-il à vos relations avec vos ami(e)s?"]
[25,"Ce trouble nuit-il à votre vie amoureuse?"]
[26,"Sur une échelle de 0 à 10, à combien estimez-vous la souffrance que vous occasionnent ces troubles avec: 0 = pas du tout de souffrance; 10 = une souffrance extrême."]
[null,{"$f":"IF(recueil!P42<26,\"Merci de bien vouloir compléter le questionnaire avant de continuer\",\"Merci. Vous pouvez maintenant passer à la suite.\")","v":"Merci de bien vouloir compléter le questionnaire avant de continuer"}]

{"sheet":"TestsBN","index":3,"n_rows":36,"n_cols":2,"rows_kept":36,"cut":false,"hidden":false,"merged":[[3,0,3,1],[4,0,6,1],[0,1,1,1]]}
[null,"Questionnaire d'évaluation de la boulimie et des accès hyperphagiques"]
[]
[]
["Instructions"]
["Vous trouverez ci-dessous une série de questions permettant de préciser le diagnostic et l'intensité du trouble des conduites alimentaires dont vous souffrez. Il évalue aussi son impact sur votre vie quotidienne. Choisissez la réponse vous paraissant la plus adaptée pour la période des 15 derniers jours."]
[]
[]
[null,"Évaluation diagnostique"]
[1,"A quelle fréquence moyenne avez-vous eu des crises boulimiques ou des journées entières de pertes de contrôle de votre alimentation?"]
[2,"Cette phase de crises de boulimie ou de pertes de contrôle dure depuis combien de temps d'après vous ?"]
[3,"Ces crises ou pertes de contrôle sont-elles suivies de vomissements ?"]
[4,"Faites-vous recours à des laxatifs dans le but de compenser les effets des crises ?"]
[5,"Faites-vous recours à des diurétiques dans le but de compenser les effets des crises ?"]
[6,"Avez-vous tendance à réduire le nombre de repas pris chaque jour ?"]
[7,"Evitez-vous de manger certains aliments systématiquement ?"]
[8,"Faites-vous du sport ou des exercices physiques pour contrôler votre poids ?"]
[9,"Considérez-vous que votre poids et/ou votre silhouette influencent votre estime personnelle et l'image qu'on a de vous ?"]
[null,"Évaluation de l'incidence des troubles"]
[10,"Quel est l'impact des crises et comportements compensatoires sur vos dents ?"]
[11,"Quel est l'impact des crises et comportements compensatoires sur votre tube digestif ?"]
[12,"Quel est l'impact des crises et comportements compensatoires sur votre sensation de fatigue physique ?"]
[13,"Quel est l'impact du trouble sur votre sexualité ?"]
[14,"Ces crises ou pertes de contrôle ont-elles un effet sur votre moral ?"]
[15,"Ces crises ou pertes de contrôle ont-elles un effet sur votre niveau d'anxiété ?"]
[16,"Ces crises ou pertes de contrôle ont-elles un effet sur votre estime personnelle ?"]
[17,"Ces crises ou pertes de contrôle vous rendent-elles irritable?"]
[18,"Ces crises ou pertes de contrôle nuisent-elles à votre capacité à vous concentrer dans vos activités?"]
[19,"Votre sommeil en est-il perturbé?"]
[20,"A cause de ces crises et pertes de contrôle, vous arrive-t-il de prendre de l'alcool, des drogues ou des médicaments non prescrits?"]
[21,"Ces troubles vous empêchent-ils de travailler?"]
[22,"Ces crises ont-elles un impact sur votre budget?"]
[23,"Ces troubles nuisent-ils à vos relations avec les membres de votre famille (parents, enfants ou proches)?"]
[24,"Ces troubles nuisent-ils à vos relations avec vos ami(e)s?"]
[25,"Ces troubles nuisent-ils à votre vie amoureuse?"]
[26,"Sur une échelle de 0 à 10, à combien estimez-vous la souffrance que vous occasionnent ces troubles avec: 0 = pas du tout de souffrance; 10 = une souffrance extrême."]
[null,{"$f":"IF(recueil!N42<26,\"Merci de bien vouloir compléter le questionnaire avant de continuer\",\"Merci. Vous pouvez passer à la suite.\")","v":"Merci de bien vouloir compléter le questionnaire avant de continuer"}]

{"sheet":"Facteurs","index":4,"n_rows":104,"n_cols":2,"rows_kept":104,"cut":false,"hidden":false,"merged":[[2,0,2,1],[3,1,5,1]]}
[null,"Evaluation des facteurs d'entretien"]
[]
["Instructions"]
[null,"Vous trouverez ci-dessous une série d'affirmations permettant de préciser les éventuels facteurs qui peuvent favoriser le maintien de votre trouble des conduites alimentaires. Répondez, s'il vous plait, à toutes les lignes. Choisissez la réponse la plus vraie pour vous en ce moment."]
[]
[]
[null,"Désir de maigrir"]
[1,"Toute prise de poids est inacceptable pour moi."]
[2,"J’ai plus de chance de plaire aux autres en perdant du poids"]
[3,"En perdant du poids je me plairai plus à moi-même"]
[4,"L’idée de perdre du poids est une préoccupation majeure pour moi"]
[5,"Quand je perds du poids c’est une réussite et j’en suis fière"]
[6,"Ma valeur personnelle dépend du fait d’être plus mince"]
[null,"Attitudes critiques envers le corps"]
[7,"Je devrais avoir moins de graisse et plus de muscle"]
[8,"Je déteste ma silhouette"]
[9,"Je déteste certaines parties de mon corps"]
[10,"Je passe du temps à observer et à critiquer mon corps"]
[11,"Je me compare aux autres constamment"]
[12,"J’ai honte de mon corps"]
[null,"Restrictions alimentaires"]
[13,"J’évite les aliments qui risquent de me faire grossir (gras, sucrés,…)"]
[14,"J’essaie de manger moins que les autres"]
[15,"Je saute régulièrement des repas ou des collations"]
[16,"Je choisis de préférence les aliments les plus légers"]
[17,"J’éprouve de la culpabilité après les repas"]
[18,"Je ne mange pas à la même vitesse que tout le monde"]
[null,"Orthorexie (tendance à adopter des règles alimentaires strictes)"]
[19,"Ma santé dépend beaucoup de ce que je mange"]
[20,"Je sélectionne soigneusement les aliments bons pour ma santé (Bio, sans OGM, sans conservateur, …)"]
[21,"Il est indispensable d'équilibrer chaque repas"]
[22,"J’attribue à certains aliments des vertus essentielles (anti-oxydant, riches en vitamines et/ou oligo-éléments, …)"]
[23,"J'encourage mes proches à manger sainement"]
[24,"Quand je choisis mes aliments, je suis attentif(-ive) à leur origine, leur mode de fabrication et de commercialisation"]
[null,"Perfectionnisme"]
[25,"Je dois tout faire parfaitement"]
[26,"Je suis plus exigent(e) pour moi que pour les autres"]
[27,"Je dois être irréprochable"]
[28,"J’ai toujours besoin de faire plus ou mieux"]
[29,"Je fonctionne en tout ou rien"]
[30,"Je consacre beaucoup d’énergie et de temps pour faire les choses bien"]
[null,"Dépression (sur les 15 derniers jours)"]
[31,"Je me sens en permanence triste et déprimé(e)"]
[32,"Je fuis les contacts, même ceux que je trouvais agréables auparavant"]
[33,"Je ne crois pas que les choses iront mieux dans l’avenir"]
[34,"Je ne prends plus aucun plaisir à rien"]
[35,"J’ai perdu tout élan"]
[36,"J’ai envie de mourir"]
[null,"Tempérament anxieux"]
[37,"Je suis quelqu’un de plus anxieux que la plupart des gens"]
[38,"Je me prémunis en permanence contre les catastrophes éventuelles"]
[39,"Si je n’y prends garde, je peux être responsable d’une erreur grave"]
[40,"Je suis tendu(e) en permanence"]
[41,"Je panique facilement"]
[42,"Les gens me trouvent nerveux(se)"]
[null,"Impulsivité"]
[43,"J’ai des coups de tête"]
[44,"J’ai besoin d’émotions fortes"]
[45,"Je suis casse-cou, j’aime prendre des risques"]
[46,"Je ne vais pas au bout des choses, je me lasse facilement"]
[47,"Je me laisse facilement surprendre par les événements"]
[48,"Je résiste mal à mes impulsions"]
[null,"Hypercontrôle"]
[49,"Je ne dois pas me laisser déborder par mes émotions"]
[50,"Je dois garder le contrôle de mes actes"]
[51,"Je ne dois pas être esclave de mes envies et de mes besoins"]
[52,"Je suis paniqué(e) à l’idée de lâcher-prise, dans tous les domaines"]
[53,"Mon entourage me reproche d’être trop directif(ve)"]
[54,"Je suis contrarié(e) par les imprévus"]
[null,"Inhibition"]
[55,"J’ai de la peine à faire valoir mes droits, mes besoins ou mes idées  auprès des autres"]
[56,"Je suis timide"]
[57,"Les besoins et les désirs des autres passent avant les miens"]
[58,"Je préfère me mettre en retrait plutôt que de risquer un conflit"]
[59,"Je dois plaire à tout le monde"]
[60,"Je n'aime pas parler de moi"]
[null,"Vie sociale et relationnelle"]
[61,"J’ai de la peine à trouver ma place dans la société"]
[62,"Je ne me sens pas utile pour les autres"]
[63,"Je souffre d'avoir peu ou pas d’ami(e)s intimes"]
[64,"Je ne me sens pas en sécurité dans mes relations avec les autres"]
[65,"Je me sens différent(e)"]
[66,"J'accorde difficilement ma confiance"]
[null,"Faible estime de soi"]
[67,"Je n'ai pas de raisons d'être fier (fière) de moi"]
[68,"Je suis nul(le) et sans valeur"]
[69,"J’ai du mal à me trouver des qualités ou des compétences"]
[70,"Les autres sont mieux que moi"]
[71,"J’ai souvent honte de moi"]
[72,"Je me sens souvent en échec dans ce que j’entreprends"]
[null,"Evitement de la maturité"]
[73,"J’ai besoin qu’on me rassure et qu’on me protège"]
[74,"Je fuis les responsabilités"]
[75,"Avoir un corps d’adulte me déplaît"]
[76,"Être mince fait paraître plus jeune"]
[77,"Je ne me vois pas avoir des enfants"]
[78,"Je suis incapable d’être autonome"]
[null,"Motivation envers les soins"]
[79,"Si je le pouvais, je préfèrerais m’y engager plus tard"]
[80,"Je n’ai pas le sentiment qu’il soit nécessaire de me soigner"]
[81,"Me soigner n’améliorera pas ma qualité de vie"]
[82,"Je me sens incapable de faire ce qu’il faut pour guérir de ce trouble"]
[83,"Je n’adhère pas aux principes du traitement qui m’est proposé"]
[84,"Je ne me sens pas assez en confiance avec ce(s) soignant(s)"]

{"sheet":"RAADS","index":5,"n_rows":25,"n_cols":16,"rows_kept":25,"cut":false,"hidden":false,"merged":[[22,1,22,7],[23,1,23,7],[16,1,16,7],[10,1,10,7],[11,1,11,7],[12,1,12,7],[13,1,13,7],[14,1,14,7],[18,1,18,7],[19,1,19,7],[20,1,20,7]]}
[]
[null,"RAADS-14"]
[null,"Ce questionnaire est conçu comme un entretien semi-dirigé"]
[null,"les réponses sont à choisir dans la liste suivante:"]
[null,"\"Vrai maintenant et quand j'étais jeune\""]
[null,"\"Vrai seulement maintenant\" (fait référence aux compétences acquises)"]
[null,"\"Vrai seulement avant mes 16 ans\""]
[null,"\"Jamais vrai\""]
[null,"Choisir la réponse qui correspond le mieux à ce que dit le sujet"]
[]
[1,"Il m'est difficile de comprendre comment les autres se sentent quand nous parlons.",null,null,null,null,null,null,null,null,null,{"$f":"IF(Z11=\"\",\"\",1)","v":""},null,{"$f":"IF(Z11=\"\",\"\",4-Z11)","v":""}]
[2,"Certaines textures ordinaires qui ne dérangent pas les autres semblent très offensives quand elles touchent ma peau.",null,null,null,null,null,null,null,null,null,{"$f":"IF(Z12=\"\",\"\",1)","v":""},null,{"$f":"IF(Z12=\"\",\"\",4-Z12)","v":""}]
[3,"Il m'est très difficile de travailler et de fonctionner en groupes.",null,null,null,null,null,null,null,null,null,"",null,""]
[4,"Il m'est difficile de comprendre ce que les autres attendent de moi.",null,null,null,null,null,null,null,null,null,"",null,"","Score:",{"$f":"IF(L25<14,\"\",SUM(N11:N24))","v":""}]
[5,"Je ne sais souvent pas comment agir dans des situations sociales.",null,null,null,null,null,null,null,null,null,"",null,""]
[6,"Je peux discuter et faire la conversation avec les gens.",null,null,null,null,null,null,null,null,null,{"$f":"IF(Z16=\"\",\"\",1)","v":""},null,{"$f":"IF(Z16=\"\",\"\",Z16-1)","v":""}]
[7,"Quand je me sens submergé(e) par mes sens, je dois m'isoler pour me calmer.",null,null,null,null,null,null,null,null,null,"",null,""]
[8,"Comment me faire des amis et me socialiser est un mystère pour moi.",null,null,null,null,null,null,null,null,null,"",null,""]
[9,"Lorsque je parle à quelqu'un, j'ai du mal à savoir quand c'est à mon tour de parler ou d'écouter.",null,null,null,null,null,null,null,null,null,"",null,""]
[10,"Parfois, je dois me boucher les oreilles pour bloquer les bruits douloureux (comme le bruit d'un aspirateur ou de gens qui parlent trop ou trop fort).",null,null,null,null,null,null,null,null,null,"",null,""]
[11,"Il peut être très difficile de lire les mouvements du visage, de la main et du corps de quelqu'un lorsque nous parlons.",null,null,null,null,null,null,null,null,null,"",null,""]
[12,"Je me concentre sur les détails plutôt que sur l'idée générale.",null,null,null,null,null,null,null,null,null,"",null,""]
[13,"Je prends les choses trop à la lettre, de sorte que je rate souvent ce que les gens essaient de dire.",null,null,null,null,null,null,null,null,null,"",null,""]
[14,"Je deviens très contrarié(e) quand la façon dont j'aime faire les choses est soudainement changée.",null,null,null,null,null,null,null,null,null,"",null,""]
[null,null,null,null,null,null,null,null,null,null,null,{"$f":"SUM(L11:L24)","v":0}]

{"sheet":"GraphTCA","index":6,"n_rows":0,"n_cols":0,"rows_kept":0,"cut":false,"hidden":false,"merged":[]}

{"sheet":"Incidence","index":7,"n_rows":0,"n_cols":0,"rows_kept":0,"cut":false,"hidden":false,"merged":[]}

{"sheet":"Courbe In","index":8,"n_rows":41,"n_cols":82,"rows_kept":41,"cut":false,"hidden":false,"merged":[[19,0,20,0],[22,0,23,0],[16,0,17,1]]}
["CODE"]
[{"$f":"IF(ISBLANK(Accueil!B8),\"\",Accueil!B8)","v":" "},null,null,null,null,null,null,null,null,null,null,null,null,null,null,null,null,null,null,null,null,null,null,null,null,null,{"$f":"Accueil!B3","v":"2021-01-17"},{"$f":"AA2+7","v":"2021-01-24"},{"$f":"AB2+7","v":"2021-01-31"},"2021-02-07","2021-02-14","2021-02-21","2021-02-28","2021-03-07","2021-03-14","2021-03-21","2021-03-28","2021-04-04","2021-04-11","2021-04-18","2021-04-25","2021-05-02","2021-05-09","2021-05-16","2021-05-23","2021-05-30",{"$f":"AT2+7","v":"2021-06-06"},{"$f":"AU2+7","v":"2021-06-13"},"2021-06-20","2021-06-27","2021-07-04","2021-07-11","2021-07-18","2021-07-25","2021-08-01","2021-08-08","2021-08-15","2021-08-22","2021-08-29","2021-09-05","2021-09-12","2021-09-19","2021-09-26","2021-10-03","2021-10-10","2021-10-17","2021-10-24","2021-10-31","2021-11-07","2021-11-14","2021-11-21","2021-11-28","2021-12-05","2021-12-12","2021-12-19","2021-12-26","2022-01-02","2022-01-09","2022-01-16","2022-01-23","2022-01-30","2022-02-06"]
["Prénom",null,null,{"$f":"IF(ISBLANK(Accueil!B3),\"\",Accueil!B3)","v":44213},null,null,null,null,null,null,null,null,null,null,null,null,null,null,null,null,null,null,null,null,null,"Minimum normal",{"$f":"VLOOKUP(INT('IMC d''équilibre'!$D$5),'IMC d''équilibre'!$F:$I,2)*$B$7*$B$7","v":{"$error":"#VALUE!"}},{"$f":"AA3","v":{"$error":"#VALUE!"}},{"$error":"#VALUE!"},{"$error":"#VALUE!"},{"$f":"VLOOKUP(INT('IMC d''équilibre'!$D$5+1),'IMC d''équilibre'!$F:$I,2)*$B$7*$B$7","v":{"$error":"#VALUE!"}},{"$f":"AE3","v":{"$error":"#VALUE!"}},{"$error":"#VALUE!"},{"$error":"#VALUE!"},{"$f":"VLOOKUP(INT('IMC d''équilibre'!$D$5+2),'IMC d''équilibre'!$F:$I,2)*$B$7*$B$7","v":{"$error":"#VALUE!"}},{"$f":"AI3","v":{"$error":"#VALUE!"}},{"$error":"#VALUE!"},{"$error":"#VALUE!"},{"$f":"VLOOKUP(INT('IMC d''équilibre'!$D$5+3),'IMC d''équilibre'!$F:$I,2)*$B$7*$B$7","v":{"$error":"#VALUE!"}},{"$f":"AM3","v":{"$error":"#VALUE!"}},{"$error":"#VALUE!"},{"$error":"#VALUE!"},{"$f":"VLOOKUP(INT('IMC d''équilibre'!$D$5+4),'IMC d''équilibre'!$F:$I,2)*$B$7*$B$7","v":{"$error":"#VALUE!"}},{"$f":"AQ3","v":{"$error":"#VALUE!"}},{"$error":"#VALUE!"},{"$error":"#VALUE!"},{"$f":"VLOOKUP(INT('IMC d''équilibre'!$D$5+5),'IMC d''équilibre'!$F:$I,2)*$B$7*$B$7","v":{"$error":"#VALUE!"}},{"$f":"AU3","v":{"$error":"#VALUE!"}},{"$error":"#VALUE!"},{"$error":"#VALUE!"},{"$f":"VLOOKUP(INT('IMC d''équilibre'!$D$5+6),'IMC d''équilibre'!$F:$I,2)*$B$7*$B$7","v":{"$error":"#VALUE!"}},{"$f":"AY3","v":{"$error":"#VALUE!"}},{"$error":"#VALUE!"},{"$error":"#VALUE!"},{"$f":"VLOOKUP(INT('IMC d''équilibre'!$D$5+7),'IMC d''équilibre'!$F:$I,2)*$B$7*$B$7","v":{"$error":"#VALUE!"}},{"$f":"BC3","v":{"$error":"#VALUE!"}},{"$error":"#VALUE!"},{"$error":"#VALUE!"},{"$f":"VLOOKUP(INT('IMC d''équilibre'!$D$5+8),'IMC d''équilibre'!$F:$I,2)*$B$7*$B$7","v":{"$error":"#VALUE!"}},{"$f":"BG3","v":{"$error":"#VALUE!"}},{"$error":"#VALUE!"},{"$error":"#VALUE!"},{"$f":"VLOOKUP(INT('IMC d''équilibre'!$D$5+9),'IMC d''équilibre'!$F:$I,2)*$B$7*$B$7","v":{"$error":"#VALUE!"}},{"$f":"BK3","v":{"$error":"#VALUE!"}},{"$error":"#VALUE!"},{"$error":"#VALUE!"},{"$f":"VLOOKUP(INT('IMC d''équilibre'!$D$5+10),'IMC d''équilibre'!$F:$I,2)*$B$7*$B$7","v":{"$error":"#VALUE!"}},{"$f":"BO3","v":{"$error":"#VALUE!"}},{"$error":"#VALUE!"},{"$error":"#VALUE!"},{"$f":"VLOOKUP(INT('IMC d''équilibre'!$D$5+11),'IMC d''équilibre'!$F:$I,2)*$B$7*$B$7","v":{"$error":"#VALUE!"}},{"$f":"BS3","v":{"$error":"#VALUE!"}},{"$f":"BT3","v":{"$error":"#VALUE!"}},{"$f":"BU3","v":{"$error":"#VALUE!"}},{"$f":"VLOOKUP(INT('IMC d''équilibre'!$D$5+12),'IMC d''équilibre'!$F:$I,2)*$B$7*$B$7","v":{"$error":"#VALUE!"}},{"$f":"BW3","v":{"$error":"#VALUE!"}},{"$error":"#VALUE!"},{"$error":"#VALUE!"},{"$f":"VLOOKUP(INT('IMC d''équilibre'!$D$5+13),'IMC d''équilibre'!$F:$I,2)*$B$7*$B$7","v":{"$error":"#VALUE!"}},{"$f":"CA3","v":{"$error":"#VALUE!"}},{"$f":"CB3","v":{"$error":"#VALUE!"}},{"$f":"CC3","v":{"$error":"#VALUE!"}}]
[null,null,null,null,null,null,null,null,null,null,null,null,null,null,null,null,null,null,null,null,null,null,null,null,null,"Maximum normal",{"$f":"VLOOKUP(INT('IMC d''équilibre'!$D$5),'IMC d''équilibre'!$F:$J,5)*$B$7*$B$7","v":{"$error":"#VALUE!"}},{"$error":"#VALUE!"},{"$error":"#VALUE!"},{"$error":"#VALUE!"},{"$f":"VLOOKUP(INT('IMC d''équilibre'!$D$5+1),'IMC d''équilibre'!$F:$J,5)*$B$7*$B$7","v":{"$error":"#VALUE!"}},{"$error":"#VALUE!"},{"$error":"#VALUE!"},{"$error":"#VALUE!"},{"$f":"VLOOKUP(INT('IMC d''équilibre'!$D$5+2),'IMC d''équilibre'!$F:$J,5)*$B$7*$B$7","v":{"$error":"#VALUE!"}},{"$error":"#VALUE!"},{"$error":"#VALUE!"},{"$error":"#VALUE!"},{"$f":"VLOOKUP(INT('IMC d''équilibre'!$D$5+3),'IMC d''équilibre'!$F:$J,5)*$B$7*$B$7","v":{"$error":"#VALUE!"}},{"$error":"#VALUE!"},{"$error":"#VALUE!"},{"$error":"#VALUE!"},{"$f":"VLOOKUP(INT('IMC d''équilibre'!$D$5+4),'IMC d''équilibre'!$F:$J,5)*$B$7*$B$7","v":{"$error":"#VALUE!"}},{"$error":"#VALUE!"},{"$error":"#VALUE!"},{"$error":"#VALUE!"},{"$f":"VLOOKUP(INT('IMC d''équilibre'!$D$5+5),'IMC d''équilibre'!$F:$J,5)*$B$7*$B$7","v":{"$error":"#VALUE!"}},{"$error":"#VALUE!"},{"$error":"#VALUE!"},{"$error":"#VALUE!"},{"$f":"VLOOKUP(INT('IMC d''équilibre'!$D$5+6),'IMC d''équilibre'!$F:$J,5)*$B$7*$B$7","v":{"$error":"#VALUE!"}},{"$error":"#VALUE!"},{"$error":"#VALUE!"},{"$error":"#VALUE!"},{"$f":"VLOOKUP(INT('IMC d''équilibre'!$D$5+7),'IMC d''équilibre'!$F:$J,5)*$B$7*$B$7","v":{"$error":"#VALUE!"}},{"$error":"#VALUE!"},{"$error":"#VALUE!"},{"$error":"#VALUE!"},{"$f":"VLOOKUP(INT('IMC d''équilibre'!$D$5+8),'IMC d''équilibre'!$F:$J,5)*$B$7*$B$7","v":{"$error":"#VALUE!"}},{"$error":"#VALUE!"},{"$error":"#VALUE!"},{"$error":"#VALUE!"},{"$f":"VLOOKUP(INT('IMC d''équilibre'!$D$5+9),'IMC d''équilibre'!$F:$J,5)*$B$7*$B$7","v":{"$error":"#VALUE!"}},{"$error":"#VALUE!"},{"$error":"#VALUE!"},{"$error":"#VALUE!"},{"$f":"VLOOKUP(INT('IMC d''équilibre'!$D$5+10),'IMC d''équilibre'!$F:$J,5)*$B$7*$B$7","v":{"$error":"#VALUE!"}},{"$error":"#VALUE!"},{"$error":"#VALUE!"},{"$error":"#VALUE!"},{"$f":"VLOOKUP(INT('IMC d''équilibre'!$D$5+11),'IMC d''équilibre'!$F:$J,5)*$B$7*$B$7","v":{"$error":"#VALUE!"}},{"$f":"BS4","v":{"$error":"#VALUE!"}},{"$error":"#VALUE!"},{"$error":"#VALUE!"},{"$f":"VLOOKUP(INT('IMC d''équilibre'!$D$5+12),'IMC d''équilibre'!$F:$J,5)*$B$7*$B$7","v":{"$error":"#VALUE!"}},{"$error":"#VALUE!"},{"$error":"#VALUE!"},{"$error":"#VALUE!"},{"$f":"VLOOKUP(INT('IMC d''équilibre'!$D$5+13),'IMC d''équilibre'!$F:$J,5)*$B$7*$B$7","v":{"$error":"#VALUE!"}},{"$f":"CA4","v":{"$error":"#VALUE!"}},{"$error":"#VALUE!"},{"$error":"#VALUE!"}]
["Date de naissance",null,null,null,null,null,null,null,null,null,null,null,null,null,null,null,null,null,null,null,null,null,null,null,null,"Anorexie",{"$f":"VLOOKUP(INT('IMC d''équilibre'!$D$5),'IMC d''équilibre'!$F:$I,3)*$B$7*$B$7","v":{"$error":"#VALUE!"}},{"$error":"#VALUE!"},{"$error":"#VALUE!"},{"$error":"#VALUE!"},{"$f":"VLOOKUP(INT('IMC d''équilibre'!$D$5+1),'IMC d''équilibre'!$F:$I,3)*$B$7*$B$7","v":{"$error":"#VALUE!"}},{"$error":"#VALUE!"},{"$error":"#VALUE!"},{"$error":"#VALUE!"},{"$f":"VLOOKUP(INT('IMC d''équilibre'!$D$5+2),'IMC d''équilibre'!$F:$I,3)*$B$7*$B$7","v":{"$error":"#VALUE!"}},{"$error":"#VALUE!"},{"$error":"#VALUE!"},{"$error":"#VALUE!"},{"$f":"VLOOKUP(INT('IMC d''équilibre'!$D$5+3),'IMC d''équilibre'!$F:$I,3)*$B$7*$B$7","v":{"$error":"#VALUE!"}},{"$error":"#VALUE!"},{"$error":"#VALUE!"},{"$error":"#VALUE!"},{"$f":"VLOOKUP(INT('IMC d''équilibre'!$D$5+4),'IMC d''équilibre'!$F:$I,3)*$B$7*$B$7","v":{"$error":"#VALUE!"}},{"$error":"#VALUE!"},{"$error":"#VALUE!"},{"$error":"#VALUE!"},{"$f":"VLOOKUP(INT('IMC d''équilibre'!$D$5+5),'IMC d''équilibre'!$F:$I,3)*$B$7*$B$7","v":{"$error":"#VALUE!"}},{"$error":"#VALUE!"},{"$error":"#VALUE!"},{"$error":"#VALUE!"},{"$f":"VLOOKUP(INT('IMC d''équilibre'!$D$5+6),'IMC d''équilibre'!$F:$I,3)*$B$7*$B$7","v":{"$error":"#VALUE!"}},{"$error":"#VALUE!"},{"$error":"#VALUE!"},{"$error":"#VALUE!"},{"$f":"VLOOKUP(INT('IMC d''équilibre'!$D$5+7),'IMC d''équilibre'!$F:$I,3)*$B$7*$B$7","v":{"$error":"#VALUE!"}},{"$error":"#VALUE!"},{"$error":"#VALUE!"},{"$error":"#VALUE!"},{"$f":"VLOOKUP(INT('IMC d''équilibre'!$D$5+8),'IMC d''équilibre'!$F:$I,3)*$B$7*$B$7","v":{"$error":"#VALUE!"}},{"$error":"#VALUE!"},{"$error":"#VALUE!"},{"$error":"#VALUE!"},{"$f":"VLOOKUP(INT('IMC d''équilibre'!$D$5+9),'IMC d''équilibre'!$F:$I,3)*$B$7*$B$7","v":{"$error":"#VALUE!"}},{"$error":"#VALUE!"},{"$error":"#VALUE!"},{"$error":"#VALUE!"},{"$f":"VLOOKUP(INT('IMC d''équilibre'!$D$5+10),'IMC d''équilibre'!$F:$I,3)*$B$7*$B$7","v":{"$error":"#VALUE!"}},{"$error":"#VALUE!"},{"$error":"#VALUE!"},{"$error":"#VALUE!"},{"$f":"VLOOKUP(INT('IMC d''équilibre'!$D$5+11),'IMC d''équilibre'!$F:$I,3)*$B$7*$B$7","v":{"$error":"#VALUE!"}},{"$error":"#VALUE!"},{"$error":"#VALUE!"},{"$error":"#VALUE!"},{"$f":"VLOOKUP(INT('IMC d''équilibre'!$D$5+12),'IMC d''équilibre'!$F:$I,3)*$B$7*$B$7","v":{"$error":"#VALUE!"}},{"$error":"#VALUE!"},{"$error":"#VALUE!"},{"$error":"#VALUE!"},{"$f":"VLOOKUP(INT('IMC d''équilibre'!$D$5+13),'IMC d''équilibre'!$F:$I,3)*$B$7*$B$7","v":{"$error":"#VALUE!"}},{"$error":"#VALUE!"},{"$error":"#VALUE!"},{"$error":"#VALUE!"}]
[{"$f":"Accueil!B13","v":"00:00:00"},null,null,null,null,null,null,null,null,null,null,null,null,null,null,null,null,null,null,null,null,null,null,null,null,"Surpoids",{"$f":"IF(recueil!A2<1,\"\",'Courbe IMC'!C58*B7*B7)","v":{"$error":"#VALUE!"}},{"$f":"AA6","v":{"$error":"#VALUE!"}},{"$f":"AB6","v":{"$error":"#VALUE!"}},{"$error":"#VALUE!"},{"$f":"AD6+(AE3-AA3)","v":{"$error":"#VALUE!"}},{"$error":"#VALUE!"},{"$error":"#VALUE!"},{"$error":"#VALUE!"},{"$f":"AH6+(AI3-AE3)","v":{"$error":"#VALUE!"}},{"$error":"#VALUE!"},{"$error":"#VALUE!"},{"$error":"#VALUE!"},{"$f":"AL6+(AM3-AI3)","v":{"$error":"#VALUE!"}},{"$error":"#VALUE!"},{"$error":"#VALUE!"},{"$error":"#VALUE!"},{"$f":"AP6+(AQ3-AM3)","v":{"$error":"#VALUE!"}},{"$error":"#VALUE!"},{"$error":"#VALUE!"},{"$error":"#VALUE!"},{"$f":"AT6+(AU3-AQ3)","v":{"$error":"#VALUE!"}},{"$f":"AU6","v":{"$error":"#VALUE!"}},{"$error":"#VALUE!"},{"$error":"#VALUE!"},{"$f":"AX6+(AY3-AU3)","v":{"$error":"#VALUE!"}},{"$error":"#VALUE!"},{"$error":"#VALUE!"},{"$error":"#VALUE!"},{"$f":"BB6+(BC3-AY3)","v":{"$error":"#VALUE!"}},{"$error":"#VALUE!"},{"$error":"#VALUE!"},{"$error":"#VALUE!"},{"$f":"BF6+(BG3-BC3)","v":{"$error":"#VALUE!"}},{"$error":"#VALUE!"},{"$error":"#VALUE!"},{"$error":"#VALUE!"},{"$f":"BJ6+(BK3-BG3)","v":{"$error":"#VALUE!"}},{"$error":"#VALUE!"},{"$error":"#VALUE!"},{"$error":"#VALUE!"},{"$f":"BN6+(BO3-BK3)","v":{"$error":"#VALUE!"}},{"$error":"#VALUE!"},{"$error":"#VALUE!"},{"$error":"#VALUE!"},{"$f":"BR6+(BS3-BO3)","v":{"$error":"#VALUE!"}},{"$f":"BS6","v":{"$error":"#VALUE!"}},{"$error":"#VALUE!"},{"$error":"#VALUE!"},{"$f":"BV6+(BW3-BS3)","v":{"$error":"#VALUE!"}},{"$error":"#VALUE!"},{"$error":"#VALUE!"},{"$error":"#VALUE!"},{"$f":"BZ6+(CA3-BW3)","v":{"$error":"#VALUE!"}},{"$f":"CA6","v":{"$error":"#VALUE!"}},{"$error":"#VALUE!"},{"$error":"#VALUE!"}]
["Taille",{"$f":"IF(ISBLANK(Accueil!G3),\"\",Accueil!G3)","v":""},null,null,null,null,null,null,null,null,null,null,null,null,null,null,null,null,null,null,null,null,null,null,null,"Obésité",{"$f":"IF(recueil!A2<1,\"\",'Courbe IMC'!C59*B7*B7)","v":{"$error":"#VALUE!"}},{"$f":"AA7","v":{"$error":"#VALUE!"}},{"$error":"#VALUE!"},{"$error":"#VALUE!"},{"$f":"AD7+(AE3-AA3)","v":{"$error":"#VALUE!"}},{"$error":"#VALUE!"},{"$error":"#VALUE!"},{"$error":"#VALUE!"},{"$f":"AH7+(AI3-AE3)","v":{"$error":"#VALUE!"}},{"$error":"#VALUE!"},{"$error":"#VALUE!"},{"$error":"#VALUE!"},{"$f":"AL7+(AM3-AI3)","v":{"$error":"#VALUE!"}},{"$error":"#VALUE!"},{"$error":"#VALUE!"},{"$error":"#VALUE!"},{"$f":"AP7+(AQ3-AM3)","v":{"$error":"#VALUE!"}},{"$error":"#VALUE!"},{"$error":"#VALUE!"},{"$error":"#VALUE!"},{"$f":"AT7+(AU3-AQ3)","v":{"$error":"#VALUE!"}},{"$error":"#VALUE!"},{"$error":"#VALUE!"},{"$error":"#VALUE!"},{"$f":"AX7+(AY3-AU3)","v":{"$error":"#VALUE!"}},{"$error":"#VALUE!"},{"$error":"#VALUE!"},{"$error":"#VALUE!"},{"$f":"BB7+(BC3-AY3)","v":{"$error":"#VALUE!"}},{"$error":"#VALUE!"},{"$error":"#VALUE!"},{"$error":"#VALUE!"},{"$f":"BF7+(BG3-BC3)","v":{"$error":"#VALUE!"}},{"$error":"#VALUE!"},{"$error":"#VALUE!"},{"$error":"#VALUE!"},{"$f":"BJ7+(BK3-BG3)","v":{"$error":"#VALUE!"}},{"$error":"#VALUE!"},{"$error":"#VALUE!"},{"$error":"#VALUE!"},{"$f":"BN7+(BO3-BK3)","v":{"$error":"#VALUE!"}},{"$error":"#VALUE!"},{"$error":"#VALUE!"},{"$error":"#VALUE!"},{"$f":"BR7+(BS3-BO3)","v":{"$error":"#VALUE!"}},{"$error":"#VALUE!"},{"$error":"#VALUE!"},{"$error":"#VALUE!"},{"$f":"BV7+(BW3-BS3)","v":{"$error":"#VALUE!"}},{"$error":"#VALUE!"},{"$error":"#VALUE!"},{"$error":"#VALUE!"},{"$f":"BZ7+(CA3-BW3)","v":{"$error":"#VALUE!"}},{"$error":"#VALUE!"},{"$error":"#VALUE!"},{"$error":"#VALUE!"}]
["Poids de départ",{"$f":"IF(ISBLANK(Accueil!E3),\"\",Accueil!E3)","v":""},null,null,null," ",null,null,null,null,null,null,null,null,null,null,null,null,null,null,null,null,null,null,null,"Hospitalisation",{"$f":"VLOOKUP(INT('IMC d''équilibre'!$D$5),'IMC d''équilibre'!$F:$K,6)*$B$7*$B$7","v":{"$error":"#VALUE!"}},{"$error":"#VALUE!"},{"$error":"#VALUE!"},{"$error":"#VALUE!"},{"$f":"VLOOKUP(INT('IMC d''équilibre'!$D$5+1),'IMC d''équilibre'!$F:$K,6)*$B$7*$B$7","v":{"$error":"#VALUE!"}},{"$error":"#VALUE!"},{"$error":"#VALUE!"},{"$error":"#VALUE!"},{"$f":"VLOOKUP(INT('IMC d''équilibre'!$D$5+2),'IMC d''équilibre'!$F:$K,6)*$B$7*$B$7","v":{"$error":"#VALUE!"}},{"$error":"#VALUE!"},{"$error":"#VALUE!"},{"$error":"#VALUE!"},{"$f":"VLOOKUP(INT('IMC d''équilibre'!$D$5+3),'IMC d''équilibre'!$F:$K,6)*$B$7*$B$7","v":{"$error":"#VALUE!"}},{"$error":"#VALUE!"},{"$error":"#VALUE!"},{"$error":"#VALUE!"},{"$f":"VLOOKUP(INT('IMC d''équilibre'!$D$5+4),'IMC d''équilibre'!$F:$K,6)*$B$7*$B$7","v":{"$error":"#VALUE!"}},{"$error":"#VALUE!"},{"$error":"#VALUE!"},{"$error":"#VALUE!"},{"$f":"VLOOKUP(INT('IMC d''équilibre'!$D$5+5),'IMC d''équilibre'!$F:$K,6)*$B$7*$B$7","v":{"$error":"#VALUE!"}},{"$f":"AU8","v":{"$error":"#VALUE!"}},{"$error":"#VALUE!"},{"$error":"#VALUE!"},{"$f":"VLOOKUP(INT('IMC d''équilibre'!$D$5+6),'IMC d''équilibre'!$F:$K,6)*$B$7*$B$7","v":{"$error":"#VALUE!"}},{"$error":"#VALUE!"},{"$error":"#VALUE!"},{"$error":"#VALUE!"},{"$f":"VLOOKUP(INT('IMC d''équilibre'!$D$5+7),'IMC d''équilibre'!$F:$K,6)*$B$7*$B$7","v":{"$error":"#VALUE!"}},{"$error":"#VALUE!"},{"$error":"#VALUE!"},{"$error":"#VALUE!"},{"$f":"VLOOKUP(INT('IMC d''équilibre'!$D$5+8),'IMC d''équilibre'!$F:$K,6)*$B$7*$B$7","v":{"$error":"#VALUE!"}},{"$error":"#VALUE!"},{"$error":"#VALUE!"},{"$error":"#VALUE!"},{"$f":"VLOOKUP(INT('IMC d''équilibre'!$D$5+9),'IMC d''équilibre'!$F:$K,6)*$B$7*$B$7","v":{"$error":"#VALUE!"}},{"$error":"#VALUE!"},{"$error":"#VALUE!"},{"$error":"#VALUE!"},{"$f":"VLOOKUP(INT('IMC d''équilibre'!$D$5+10),'IMC d''équilibre'!$F:$K,6)*$B$7*$B$7","v":{"$error":"#VALUE!"}},{"$error":"#VALUE!"},{"$error":"#VALUE!"},{"$error":"#VALUE!"},{"$f":"VLOOKUP(INT('IMC d''équilibre'!$D$5+11),'IMC d''équilibre'!$F:$K,6)*$B$7*$B$7","v":{"$error":"#VALUE!"}},{"$error":"#VALUE!"},{"$error":"#VALUE!"},{"$error":"#VALUE!"},{"$f":"VLOOKUP(INT('IMC d''équilibre'!$D$5+12),'IMC d''équilibre'!$F:$K,6)*$B$7*$B$7","v":{"$error":"#VALUE!"}},{"$error":"#VALUE!"},{"$error":"#VALUE!"},{"$error":"#VALUE!"},{"$f":"VLOOKUP(INT('IMC d''équilibre'!$D$5+13),'IMC d''équilibre'!$F:$K,6)*$B$7*$B$7","v":{"$error":"#VALUE!"}},{"$error":"#VALUE!"},{"$error":"#VALUE!"},{"$error":"#VALUE!"}]
["IMC de départ",{"$f":"IF(ISBLANK(Accueil!G3),\"\",B8/(B7*B7))","v":""},null,null,null,null,{"$f":"IF(ISBLANK(recueil!E5),\"\",(recueil!E5-1))","v":-1},null,null,null,null,null,null,null,null,null,null,null,null,null,null,null,null,null,null,"Danger",{"$f":"VLOOKUP(INT('IMC d''équilibre'!$D$5),'IMC d''équilibre'!$F:$I,4)*$B$7*$B$7","v":{"$error":"#VALUE!"}},{"$error":"#VALUE!"},{"$error":"#VALUE!"},{"$error":"#VALUE!"},{"$f":"VLOOKUP(INT('IMC d''équilibre'!$D$5+1),'IMC d''équilibre'!$F:$J,4)*$B$7*$B$7","v":{"$error":"#VALUE!"}},{"$error":"#VALUE!"},{"$error":"#VALUE!"},{"$error":"#VALUE!"},{"$f":"VLOOKUP(INT('IMC d''équilibre'!$D$5+2),'IMC d''équilibre'!$F:$I,4)*$B$7*$B$7","v":{"$error":"#VALUE!"}},{"$error":"#VALUE!"},{"$error":"#VALUE!"},{"$error":"#VALUE!"},{"$f":"VLOOKUP(INT('IMC d''équilibre'!$D$5+3),'IMC d''équilibre'!$F:$I,4)*$B$7*$B$7","v":{"$error":"#VALUE!"}},{"$error":"#VALUE!"},{"$error":"#VALUE!"},{"$error":"#VALUE!"},{"$f":"VLOOKUP(INT('IMC d''équilibre'!$D$5+4),'IMC d''équilibre'!$F:$I,4)*$B$7*$B$7","v":{"$error":"#VALUE!"}},{"$error":"#VALUE!"},{"$error":"#VALUE!"},{"$error":"#VALUE!"},{"$f":"VLOOKUP(INT('IMC d''équilibre'!$D$5+5),'IMC d''équilibre'!$F:$I,4)*$B$7*$B$7","v":{"$error":"#VALUE!"}},{"$f":"AU9","v":{"$error":"#VALUE!"}},{"$error":"#VALUE!"},{"$error":"#VALUE!"},{"$f":"VLOOKUP(INT('IMC d''équilibre'!$D$5+6),'IMC d''équilibre'!$F:$I,4)*$B$7*$B$7","v":{"$error":"#VALUE!"}},{"$error":"#VALUE!"},{"$error":"#VALUE!"},{"$error":"#VALUE!"},{"$f":"VLOOKUP(INT('IMC d''équilibre'!$D$5+7),'IMC d''équilibre'!$F:$I,4)*$B$7*$B$7","v":{"$error":"#VALUE!"}},{"$error":"#VALUE!"},{"$error":"#VALUE!"},{"$error":"#VALUE!"},{"$f":"VLOOKUP(INT('IMC d''équilibre'!$D$5+8),'IMC d''équilibre'!$F:$I,4)*$B$7*$B$7","v":{"$error":"#VALUE!"}},{"$error":"#VALUE!"},{"$error":"#VALUE!"},{"$error":"#VALUE!"},{"$f":"VLOOKUP(INT('IMC d''équilibre'!$D$5+9),'IMC d''équilibre'!$F:$I,4)*$B$7*$B$7","v":{"$error":"#VALUE!"}},{"$error":"#VALUE!"},{"$error":"#VALUE!"},{"$error":"#VALUE!"},{"$f":"VLOOKUP(INT('IMC d''équilibre'!$D$5+10),'IMC d''équilibre'!$F:$I,4)*$B$7*$B$7","v":{"$error":"#VALUE!"}},{"$error":"#VALUE!"},{"$error":"#VALUE!"},{"$error":"#VALUE!"},{"$f":"VLOOKUP(INT('IMC d''équilibre'!$D$5+11),'IMC d''équilibre'!$F:$I,4)*$B$7*$B$7","v":{"$error":"#VALUE!"}},{"$error":"#VALUE!"},{"$error":"#VALUE!"},{"$error":"#VALUE!"},{"$f":"VLOOKUP(INT('IMC d''équilibre'!$D$5+12),'IMC d''équilibre'!$F:$I,4)*$B$7*$B$7","v":{"$error":"#VALUE!"}},{"$error":"#VALUE!"},{"$error":"#VALUE!"},{"$error":"#VALUE!"},{"$f":"VLOOKUP(INT('IMC d''équilibre'!$D$5+13),'IMC d''équilibre'!$F:$I,4)*$B$7*$B$7","v":{"$error":"#VALUE!"}},{"$error":"#VALUE!"},{"$error":"#VALUE!"},{"$error":"#VALUE!"}]
["Minimum normal",{"$f":"IF(ISBLANK(Accueil!B$8),\"\",'IMC d''équilibre'!D$12)","v":{"$error":"#VALUE!"}}]
["Seuil pathologique",{"$f":"IF(ISBLANK(Accueil!G3),\"\",AA5)","v":""}]
["Maigreur sévère",{"$f":"IF(ISBLANK(Accueil!G3),\"\",AA8)","v":""}]
["Maigreur extrême",{"$f":"IF(ISBLANK(Accueil!G3),\"\",AA9)","v":""}]
["Surpoids",{"$f":"IF(ISBLANK(Accueil!G3),\"\",AA6)","v":""}]
["Obésité",{"$f":"IF(ISBLANK(Accueil!G3),\"\",AA7)","v":""}]
[]
["Modifier les limites du graphique :"]
[]
["inférieure:"]
[40]
[]
["supérieure:"]
[96]
[]
[]
[]
[]
[]
[]
[]
[]
[]
[]
[]
[]
[]
[]
[]
[]
[null,null,null,null,null,null,null,null,null,{"$f":"A4","v":0}]
[null,null,null,null,null,null,null,null,null,{"$f":"A2","v":" "}]

{"sheet":"GraphIMC","index":9,"n_rows":0,"n_cols":0,"rows_kept":0,"cut":false,"hidden":false,"merged":[]}

{"sheet":"Courbe IMC","index":10,"n_rows":187,"n_cols":62,"rows_kept":187,"cut":false,"hidden":false,"merged":[]}
["corrections hô","MAX",0.2,0.5,0.25,0.25,0.25,0.2,0.2,0.12,0.2,0,-0.15,-0.1,0,0.1,0.15,0.2,0.2,0.56999999999999995,0.68,0.72,0.73,0.8]
[null,"MIN",0,0.1,0.1,0.1,0.15,0.24,0.2,0.25,0.18,0.1,-0.05,-0.35,-0.4,-0.4,-0.4,-0.25,-0.1,0.05,0.25,0.5,0.65,0.85]
[null,"Age",1,2,3,4,5,6,7,8,9,10,11,12,13,14,15,16,17,18,19,20,21,22]
[null,"Dates",{"$f":"'Courbe In'!$A$6+365.25*C3","v":"1900-12-30T06:00:00"},{"$f":"'Courbe In'!$A$6+365.25*D3","v":"1901-12-30T12:00:00"},{"$f":"'Courbe In'!$A$6+365.25*E3","v":"1902-12-30T18:00:00"},{"$f":"'Courbe In'!$A$6+365.25*F3","v":"1903-12-31"},{"$f":"'Courbe In'!$A$6+365.25*G3","v":"1904-12-30T06:00:00"},{"$f":"'Courbe In'!$A$6+365.25*H3","v":"1905-12-30T12:00:00"},{"$f":"'Courbe In'!$A$6+365.25*I3","v":"1906-12-30T18:00:00"},{"$f":"'Courbe In'!$A$6+365.25*J3","v":"1907-12-31"},{"$f":"'Courbe In'!$A$6+365.25*K3","v":"1908-12-30T06:00:00"},{"$f":"'Courbe In'!$A$6+365.25*L3","v":"1909-12-30T12:00:00"},{"$f":"'Courbe In'!$A$6+365.25*M3","v":"1910-12-30T18:00:00"},{"$f":"'Courbe In'!$A$6+365.25*N3","v":"1911-12-31"},{"$f":"'Courbe In'!$A$6+365.25*O3","v":"1912-12-30T06:00:00"},{"$f":"'Courbe In'!$A$6+365.25*P3","v":"1913-12-30T12:00:00"},{"$f":"'Courbe In'!$A$6+365.25*Q3","v":"1914-12-30T18:00:00"},{"$f":"'Courbe In'!$A$6+365.25*R3","v":"1915-12-31"},{"$f":"'Courbe In'!$A$6+365.25*S3","v":"1916-12-30T06:00:00"},{"$f":"'Courbe In'!$A$6+365.25*T3","v":"1917-12-30T12:00:00"},{"$f":"'Courbe In'!$A$6+365.25*U3","v":"1918-12-30T18:00:00"},{"$f":"'Courbe In'!$A$6+365.25*V3","v":"1919-12-31"},{"$f":"'Courbe In'!$A$6+365.25*W3","v":"1920-12-30T06:00:00"},{"$f":"'Courbe In'!$A$6+365.25*X3","v":"1921-12-30T12:00:00"}]
[null,"MIN",{"$f":"16.4+(C2*'Courbe In'!G9)","v":16.399999999999999},{"$f":"15.5+(D2*'Courbe In'!G9)","v":15.4},{"$f":"14.9+(E2*'Courbe In'!G9)","v":14.8},{"$f":"14.6+(F2*'Courbe In'!G9)","v":14.5},{"$f":"14.45+(G2*'Courbe In'!G9)","v":14.299999999999999},{"$f":"14.35+(H2*'Courbe In'!G9)","v":14.11},{"$f":"14.4+(I2*'Courbe In'!G9)","v":14.200000000000001},{"$f":"14.5+(J2*'Courbe In'!G9)","v":14.25},{"$f":"14.8+(K2*'Courbe In'!G9)","v":14.620000000000001},{"$f":"15.1+(L2*'Courbe In'!G9)","v":15},{"$f":"15.5+(M2*'Courbe In'!G9)","v":15.55},{"$f":"16.1+(N2*'Courbe In'!G9)","v":16.450000000000003},{"$f":"16.6+(O2*'Courbe In'!G9)","v":17},{"$f":"17.3+(P2*'Courbe In'!G9)","v":17.7},{"$f":"17.9+(Q2*'Courbe In'!G9)","v":18.299999999999997},{"$f":"18.35+(R2*'Courbe In'!G9)","v":18.600000000000001},{"$f":"18.6+(S2*'Courbe In'!G9)","v":18.700000000000003},{"$f":"18.75+(T2*'Courbe In'!G9)","v":18.7},{"$f":"18.85+(U2*'Courbe In'!G9)","v":18.600000000000001},{"$f":"18.9+(V2*'Courbe In'!G9)","v":18.399999999999999},{"$f":"18.95+(W2*'Courbe In'!G9)","v":18.3},{"$f":"19+(X2*'Courbe In'!G9)","v":18.149999999999999}]
["Prénom","MAX",{"$f":"18.5+('Courbe In'!G9*C1)","v":18.3},{"$f":"17+(D1*'Courbe In'!G9)","v":16.5},{"$f":"16.4+(E1*'Courbe In'!G9)","v":16.149999999999999},{"$f":"16.1+(F1*'Courbe In'!G9)","v":15.850000000000001},{"$f":"16+(G1*'Courbe In'!G9)","v":15.75},{"$f":"16.05+(H1*'Courbe In'!G9)","v":15.850000000000001},{"$f":"16.2+(I1*'Courbe In'!G9)","v":16},{"$f":"16.5+(J1*'Courbe In'!G9)","v":16.38},{"$f":"16.8+(K1*'Courbe In'!G9)","v":16.600000000000001},{"$f":"17.4+(L1*'Courbe In'!G9)","v":17.399999999999999},{"$f":"18+(M1*'Courbe In'!G9)","v":18.149999999999999},{"$f":"18.6+(N1*'Courbe In'!G9)","v":18.700000000000003},{"$f":"19.25+(O1*'Courbe In'!G9)","v":19.25},{"$f":"19.8+(P1*'Courbe In'!G9)","v":19.7},{"$f":"20.4+(Q1*'Courbe In'!G9)","v":20.25},{"$f":"20.9+(R1*'Courbe In'!G9)","v":20.7},{"$f":"21.2+(S1*'Courbe In'!G9)","v":21},{"$f":"21.5+(T1*'Courbe In'!G9)","v":20.93},{"$f":"21.8+(U1*'Courbe In'!G9)","v":21.12},{"$f":"22+(V1*'Courbe In'!G9)","v":21.28},{"$f":"22.1+(W1*'Courbe In'!G9)","v":21.37},{"$f":"22.2+(X1*'Courbe In'!G9)","v":21.4},{"$f":"22.2+(Y1*'Courbe In'!G9)","v":22.2},{"$f":"22.2+(Z1*'Courbe In'!G9)","v":22.2},{"$f":"22.2+(AA1*'Courbe In'!G9)","v":22.2},{"$f":"22.2+(AB1*'Courbe In'!G9)","v":22.2},{"$f":"22.2+(AC1*'Courbe In'!G9)","v":22.2},{"$f":"22.2+(AD1*'Courbe In'!G9)","v":22.2},{"$f":"22.2+(AE1*'Courbe In'!G9)","v":22.2},{"$f":"22.2+(AF1*'Courbe In'!G9)","v":22.2},{"$f":"22.2+(AG1*'Courbe In'!G9)","v":22.2},{"$f":"22.2+(AH1*'Courbe In'!G9)","v":22.2},{"$f":"22.2+(AI1*'Courbe In'!G9)","v":22.2},{"$f":"22.2+(AJ1*'Courbe In'!G9)","v":22.2},{"$f":"22.2+(AK1*'Courbe In'!G9)","v":22.2},{"$f":"22.2+(AL1*'Courbe In'!G9)","v":22.2},{"$f":"22.2+(AM1*'Courbe In'!G9)","v":22.2},{"$f":"22.2+(AN1*'Courbe In'!G9)","v":22.2},{"$f":"22.2+(AO1*'Courbe In'!G9)","v":22.2},{"$f":"22.2+(AP1*'Courbe In'!G9)","v":22.2},{"$f":"22.2+(AQ1*'Courbe In'!G9)","v":22.2},{"$f":"22.2+(AR1*'Courbe In'!G9)","v":22.2},{"$f":"22.2+(AS1*'Courbe In'!G9)","v":22.2},{"$f":"22.2+(AT1*'Courbe In'!G9)","v":22.2},{"$f":"22.2+(AU1*'Courbe In'!G9)","v":22.2},{"$f":"22.2+(AV1*'Courbe In'!G9)","v":22.2},{"$f":"22.2+(AW1*'Courbe In'!G9)","v":22.2},{"$f":"22.2+(AX1*'Courbe In'!G9)","v":22.2},{"$f":"22.2+(AY1*'Courbe In'!G9)","v":22.2},{"$f":"22.2+(AZ1*'Courbe In'!G9)","v":22.2}]
[{"$f":"IF(ISBLANK('Courbe In'!A4),\"\",'Courbe In'!A4)","v":""},"IMC",{"$f":"IF(ISBLANK(C8),\"\",IF(ISBLANK(C9),\"\",C8/(C9*C9)))","v":""},"","","","","","","","","","","","","","","","","","","","","","","","","","","","","","","","","","","","","","","","","","","","","","","","","",{"$f":"IF(ISBLANK(BA8),\"\",IF(ISBLANK(BA9),\"\",BA8/(BA9*BA9)))","v":""},"","","","","","","","",""]
["Date de naissance","Poids"]
[{"$f":"IF(ISBLANK(Accueil!B13),\"\",Accueil!B13)","v":""},"Taille"]
[null,"Dates"]
[null,"Age",{"$f":"IF(ISBLANK(C10),\"\",(C10-'Courbe In'!$A$6)/365.25)","v":""},{"$f":"IF(ISBLANK(D10),\"\",(D10-'Courbe In'!$A$6)/365.25)","v":""},{"$f":"IF(ISBLANK(E10),\"\",(E10-'Courbe In'!$A$6)/365.25)","v":""},{"$f":"IF(ISBLANK(F10),\"\",(F10-'Courbe In'!$A$6)/365.25)","v":""},{"$f":"IF(ISBLANK(G10),\"\",(G10-'Courbe In'!$A$6)/365.25)","v":""},{"$f":"IF(ISBLANK(H10),\"\",(H10-'Courbe In'!$A$6)/365.25)","v":""},{"$f":"IF(ISBLANK(I10),\"\",(I10-'Courbe In'!$A$6)/365.25)","v":""},{"$f":"IF(ISBLANK(J10),\"\",(J10-'Courbe In'!$A$6)/365.25)","v":""},{"$f":"IF(ISBLANK(K10),\"\",(K10-'Courbe In'!$A$6)/365.25)","v":""},{"$f":"IF(ISBLANK(L10),\"\",(L10-'Courbe In'!$A$6)/365.25)","v":""},{"$f":"IF(ISBLANK(M10),\"\",(M10-'Courbe In'!$A$6)/365.25)","v":""},{"$f":"IF(ISBLANK(N10),\"\",(N10-'Courbe In'!$A$6)/365.25)","v":""},{"$f":"IF(ISBLANK(O10),\"\",(O10-'Courbe In'!$A$6)/365.25)","v":""},{"$f":"IF(ISBLANK(P10),\"\",(P10-'Courbe In'!$A$6)/365.25)","v":""},{"$f":"IF(ISBLANK(Q10),\"\",(Q10-'Courbe In'!$A$6)/365.25)","v":""},{"$f":"IF(ISBLANK(R10),\"\",(R10-'Courbe In'!$A$6)/365.25)","v":""},{"$f":"IF(ISBLANK(S10),\"\",(S10-'Courbe In'!$A$6)/365.25)","v":""},{"$f":"IF(ISBLANK(T10),\"\",(T10-'Courbe In'!$A$6)/365.25)","v":""},{"$f":"IF(ISBLANK(U10),\"\",(U10-'Courbe In'!$A$6)/365.25)","v":""},{"$f":"IF(ISBLANK(V10),\"\",(V10-'Courbe In'!$A$6)/365.25)","v":""},{"$f":"IF(ISBLANK(W10),\"\",(W10-'Courbe In'!$A$6)/365.25)","v":""},{"$f":"IF(ISBLANK(X10),\"\",(X10-'Courbe In'!$A$6)/365.25)","v":""},{"$f":"IF(ISBLANK(Y10),\"\",(Y10-'Courbe In'!$A$6)/365.25)","v":""},{"$f":"IF(ISBLANK(Z10),\"\",(Z10-'Courbe In'!$A$6)/365.25)","v":""},{"$f":"IF(ISBLANK(AA10),\"\",(AA10-'Courbe In'!$A$6)/365.25)","v":""},{"$f":"IF(ISBLANK(AB10),\"\",(AB10-'Courbe In'!$A$6)/365.25)","v":""},{"$f":"IF(ISBLANK(AC10),\"\",(AC10-'Courbe In'!$A$6)/365.25)","v":""},{"$f":"IF(ISBLANK(AD10),\"\",(AD10-'Courbe In'!$A$6)/365.25)","v":""},{"$f":"IF(ISBLANK(AE10),\"\",(AE10-'Courbe In'!$A$6)/365.25)","v":""},{"$f":"IF(ISBLANK(AF10),\"\",(AF10-'Courbe In'!$A$6)/365.25)","v":""},{"$f":"IF(ISBLANK(AG10),\"\",(AG10-'Courbe In'!$A$6)/365.25)","v":""},{"$f":"IF(ISBLANK(AH10),\"\",(AH10-'Courbe In'!$A$6)/365.25)","v":""},{"$f":"IF(ISBLANK(AI10),\"\",(AI10-'Courbe In'!$A$6)/365.25)","v":""},{"$f":"IF(ISBLANK(AJ10),\"\",(AJ10-'Courbe In'!$A$6)/365.25)","v":""},{"$f":"IF(ISBLANK(AK10),\"\",(AK10-'Courbe In'!$A$6)/365.25)","v":""},{"$f":"IF(ISBLANK(AL10),\"\",(AL10-'Courbe In'!$A$6)/365.25)","v":""},{"$f":"IF(ISBLANK(AM10),\"\",(AM10-'Courbe In'!$A$6)/365.25)","v":""},{"$f":"IF(ISBLANK(AN10),\"\",(AN10-'Courbe In'!$A$6)/365.25)","v":""},{"$f":"IF(ISBLANK(AO10),\"\",(AO10-'Courbe In'!$A$6)/365.25)","v":""},{"$f":"IF(ISBLANK(AP10),\"\",(AP10-'Courbe In'!$A$6)/365.25)","v":""},{"$f":"IF(ISBLANK(AQ10),\"\",(AQ10-'Courbe In'!$A$6)/365.25)","v":""},{"$f":"IF(ISBLANK(AR10),\"\",(AR10-'Courbe In'!$A$6)/365.25)","v":""},{"$f":"IF(ISBLANK(AS10),\"\",(AS10-'Courbe In'!$A$6)/365.25)","v":""},{"$f":"IF(ISBLANK(AT10),\"\",(AT10-'Courbe In'!$A$6)/365.25)","v":""},{"$f":"IF(ISBLANK(AU10),\"\",(AU10-'Courbe In'!$A$6)/365.25)","v":""},{"$f":"IF(ISBLANK(AV10),\"\",(AV10-'Courbe In'!$A$6)/365.25)","v":""},{"$f":"IF(ISBLANK(AW10),\"\",(AW10-'Courbe In'!$A$6)/365.25)","v":""},{"$f":"IF(ISBLANK(AX10),\"\",(AX10-'Courbe In'!$A$6)/365.25)","v":""},{"$f":"IF(ISBLANK(AY10),\"\",(AY10-'Courbe In'!$A$6)/365.25)","v":""},{"$f":"IF(ISBLANK(AZ10),\"\",(AZ10-'Courbe In'!$A$6)/365.25)","v":""},{"$f":"IF(ISBLANK(BA10),\"\",(BA10-'Courbe In'!$A$6)/365.25)","v":""},{"$f":"IF(ISBLANK(BB10),\"\",(BB10-'Courbe In'!$A$6)/365.25)","v":""},{"$f":"IF(ISBLANK(BC10),\"\",(BC10-'Courbe In'!$A$6)/365.25)","v":""},{"$f":"IF(ISBLANK(BD10),\"\",(BD10-'Courbe In'!$A$6)/365.25)","v":""},{"$f":"IF(ISBLANK(BE10),\"\",(BE10-'Courbe In'!$A$6)/365.25)","v":""},{"$f":"IF(ISBLANK(BF10),\"\",(BF10-'Courbe In'!$A$6)/365.25)","v":""},{"$f":"IF(ISBLANK(BG10),\"\",(BG10-'Courbe In'!$A$6)/365.25)","v":""},{"$f":"IF(ISBLANK(BH10),\"\",(BH10-'Courbe In'!$A$6)/365.25)","v":""},{"$f":"IF(ISBLANK(BI10),\"\",(BI10-'Courbe In'!$A$6)/365.25)","v":""},{"$f":"IF(ISBLANK(BJ10),\"\",(BJ10-'Courbe In'!$A$6)/365.25)","v":""}]
[]
[]
[]
[]
[]
[null,null,null,null,null,null,null,{"$f":"(NOW()-('Courbe In'!A6))/365.25","v":121.05043227368368}]
[]
[null,null,{"$f":"C7","v":""},{"$f":"D7","v":""},{"$f":"E7","v":""},{"$f":"F7","v":""},"","","","","","","","","","","","","","","","","","","","","","","","","","","","","","","","","","","","","","","","","","","","","",""]
[null,null,{"$f":"IF(ISBLANK(C10),22,C11)","v":22},{"$f":"IF(ISBLANK(D10),22,D11)","v":22},{"$f":"IF(ISBLANK(E10),22,E11)","v":22},22,22,22,22,22,22,22,22,22,22,22,22,22,22,22,22,22,22,22,22,22,22,22,22,22,22,22,22,22,22,22,22,22,22,22,22,22,22,22,22,22,22,22,22,22,22,22]
[]
[]
[]
[]
[]
[]
[]
[]
[]
[]
[]
[]
[]
[]
[]
[]
[]
[]
[]
[null,null,null,null,null,null,null,null,null,null,null,null,{"$f":"Z7","v":""}]
[]
[]
[]
[]
[null,"Anorexie",null,null,null,null,null,null,null,null,null,{"$f":"AVERAGE(L5:L6)*0.8252","v":13.36824},13.904620000000001,14.502890000000003,14.956750000000001,15.431240000000001,15.90573,{"$f":"AVERAGE(R5:R6)*0.826","v":16.230899999999998},{"$f":"AVERAGE(S5:S6)*0.84","v":16.673999999999999},17,17,17,17,17]
[null,"Hospit.",null,null,null,null,null,null,null,null,null,{"$f":"AVERAGE(L5:L6)*0.777","v":12.587400000000001},13.092450000000001,13.655775000000002,14.083125000000001,14.5299,14.976675,15.268049999999999,15.423450000000001,16,16,16,16,16]
[null,"Danger",null,null,null,null,null,null,null,null,null,{"$f":"AVERAGE(L5:L6)*0.745","v":12.068999999999999},12.55325,13.093375000000002,13.503125000000001,13.9315,14.359874999999999,14.639249999999999,14.788250000000001,{"$f":"AVERAGE(T5:T6)*0.745","v":14.762174999999997},15,15,15,15]
[null,"Surpoids",{"$f":"AVERAGE(C5:C6)*1.09","v":18.911500000000004},{"$f":"AVERAGE(D5:D6)*1.11","v":17.704499999999999},{"$f":"AVERAGE(E5:E6)*1.12","v":17.332000000000001},{"$f":"AVERAGE(F5:F6)*1.124","v":17.056700000000003},{"$f":"AVERAGE(G5:G6)*1.125","v":16.903124999999999},{"$f":"AVERAGE(H5:H6)*1.145","v":17.152100000000001},{"$f":"AVERAGE(I5:I6)*1.168","v":17.636800000000001},{"$f":"AVERAGE(J5:J6)*1.19","v":18.22485},{"$f":"AVERAGE(K5:K6)*1.21","v":18.888100000000001},{"$f":"AVERAGE(L5:L6)*1.23","v":19.925999999999998},{"$f":"AVERAGE(M5:M6)*1.243","v":20.944550000000003},{"$f":"AVERAGE(N5:N6)*1.254","v":22.039050000000003},{"$f":"AVERAGE(O5:O6)*1.263","v":22.891874999999999},{"$f":"AVERAGE(P5:P6)*1.263","v":23.618099999999998},{"$f":"AVERAGE(Q5:Q6)*1.253","v":24.151574999999998},{"$f":"AVERAGE(R5:R6)*1.245","v":24.46425},{"$f":"AVERAGE(S5:S6)*1.246","v":24.7331},25,25,25,25,25]
[null,"Obésité",null,{"$f":"AVERAGE(D5:D6)*1.22","v":19.459},{"$f":"AVERAGE(E5:E6)*1.24","v":19.189},{"$f":"AVERAGE(F5:F6)*1.25","v":18.96875},{"$f":"AVERAGE(G5:G6)*1.262","v":18.961549999999999},{"$f":"AVERAGE(H5:H6)*1.29","v":19.324200000000001},{"$f":"AVERAGE(I5:I6)*1.34","v":20.234000000000002},{"$f":"AVERAGE(J5:J6)*1.39","v":21.287849999999999},{"$f":"AVERAGE(K5:K6)*1.45","v":22.634500000000003},{"$f":"AVERAGE(L5:L6)*1.483","v":24.0246},{"$f":"AVERAGE(M5:M6)*1.52","v":25.612000000000002},{"$f":"AVERAGE(N5:N6)*1.54","v":27.065500000000004},{"$f":"AVERAGE(O5:O6)*1.55","v":28.09375},{"$f":"AVERAGE(P5:P6)*1.54","v":28.797999999999998},{"$f":"AVERAGE(Q5:Q6)*1.52","v":29.297999999999998},{"$f":"AVERAGE(R5:R6)*1.51","v":29.671499999999998},{"$f":"AVERAGE(S5:S6)*1.51","v":29.973500000000001},30,30,30,30,30]
[null,"Médiane",{"$f":"AVERAGE(C51,C48)","v":17.491750000000003},{"$f":"AVERAGE(D51,D48)","v":16.475249999999999},15.969799999999999,15.684100000000001,15.508612499999998,15.539335000000001,15.8261,16.1448,16.659020000000002,17.365499999999997,18.1462,19.137600000000003,19.835437499999998,20.543999999999997,21.106837499999997,21.411225000000002,21.594999999999999,21.75,21.75,21.75,21.75,21.75]
[null,"Limte inf.",{"$f":"C5*0.98","v":16.071999999999999},{"$f":"D5*0.99","v":15.246},{"$f":"E5*0.987","v":14.6076},14.311500000000001,14.114099999999999,13.92657,14.015400000000001,14.06475,14.42994,14.805,15.347850000000001,16.236150000000002,16.779,17.469899999999999,18.062099999999997,18.3582,18.456900000000001,18.5,18.5,18.5,18.5,18.5]
[]
[]
[null,null,1,2,3,4,5,6,7,8,9,10,11,12,13,14,15,16,17,18,19,20,21,22]
[null,null,{"$f":"C48","v":18.911500000000004},17.704499999999999,17.332000000000001,17.056700000000003,16.903124999999999,17.152100000000001,17.636800000000001,18.22485,18.888100000000001,19.925999999999998,20.944550000000003,22.039050000000003,22.891874999999999,23.618099999999998,24.151574999999998,24.46425,24.7331,25,25,25,25,25]
[null,null,{"$f":"C49","v":0},19.459,19.189,18.96875,18.961549999999999,19.324200000000001,20.234000000000002,21.287849999999999,22.634500000000003,24.0246,25.612000000000002,27.065500000000004,28.09375,28.797999999999998,29.297999999999998,29.671499999999998,29.973500000000001,30,30,30,30,30]
[]
[null,null,{"$f":"HLOOKUP(INT(H17),C54:X56,2)","v":25}]
[null,null,{"$f":"HLOOKUP(INT(H17),C54:X56,3)","v":30}]
[]
[]
[]
[]
[]
[]
["Anorexie","Surpoids","Obésité","Données interpolées","Age"]
[null,22.859500000000001,25.302499999999998,{"$f":"IF(ISBLANK(#REF!),\"\",#REF!)","v":{"$error":"#REF!"}},{"$f":"IF(ISBLANK(#REF!),\"\",#REF!)","v":{"$error":"#REF!"}}]
[null,21.287500000000001,23.5625,{"$f":"IF(ISBLANK(#REF!),\"\",#REF!)","v":{"$error":"#REF!"}},{"$f":"IF(ISBLANK(#REF!),\"\",#REF!)","v":{"$error":"#REF!"}}]
[null,20.5015,22.692499999999999,{"$f":"IF(ISBLANK(#REF!),\"\",#REF!)","v":{"$error":"#REF!"}},{"$f":"IF(ISBLANK(#REF!),\"\",#REF!)","v":{"$error":"#REF!"}}]
[null,20.108500000000003,22.2575,{"$f":"IF(ISBLANK(#REF!),\"\",#REF!)","v":{"$error":"#REF!"}},{"$f":"IF(ISBLANK(#REF!),\"\",#REF!)","v":{"$error":"#REF!"}}]
[null,19.944749999999999,22.076250000000002,{"$f":"IF(ISBLANK(#REF!),\"\",#REF!)","v":{"$error":"#REF!"}},{"$f":"IF(ISBLANK(#REF!),\"\",#REF!)","v":{"$error":"#REF!"}}]
[null,19.911999999999999,22.04,{"$f":"IF(ISBLANK(#REF!),\"\",#REF!)","v":{"$error":"#REF!"}},{"$f":"IF(ISBLANK(#REF!),\"\",#REF!)","v":{"$error":"#REF!"}}]
[null,20.043000000000003,22.184999999999999,{"$f":"IF(ISBLANK(#REF!),\"\",#REF!)","v":{"$error":"#REF!"}},{"$f":"IF(ISBLANK(#REF!),\"\",#REF!)","v":{"$error":"#REF!"}}]
[null,20.305,22.475000000000001,{"$f":"IF(ISBLANK(#REF!),\"\",#REF!)","v":{"$error":"#REF!"}},{"$f":"IF(ISBLANK(#REF!),\"\",#REF!)","v":{"$error":"#REF!"}}]
[null,20.698,22.91,{"$f":"IF(ISBLANK(#REF!),\"\",#REF!)","v":{"$error":"#REF!"}},{"$f":"IF(ISBLANK(#REF!),\"\",#REF!)","v":{"$error":"#REF!"}}]
[13.8125,21.287500000000001,23.5625,{"$f":"IF(ISBLANK(#REF!),\"\",#REF!)","v":{"$error":"#REF!"}},{"$f":"IF(ISBLANK(#REF!),\"\",#REF!)","v":{"$error":"#REF!"}}]
[14.237500000000001,21.942499999999999,24.287500000000001,{"$f":"IF(ISBLANK(#REF!),\"\",#REF!)","v":{"$error":"#REF!"}},{"$f":"IF(ISBLANK(#REF!),\"\",#REF!)","v":{"$error":"#REF!"}}]
[14.7475,22.728500000000004,25.157499999999999,{"$f":"IF(ISBLANK(#REF!),\"\",#REF!)","v":{"$error":"#REF!"}},{"$f":"IF(ISBLANK(#REF!),\"\",#REF!)","v":{"$error":"#REF!"}}]
[15.23625,23.481750000000002,25.991250000000001,{"$f":"IF(ISBLANK(#REF!),\"\",#REF!)","v":{"$error":"#REF!"}},{"$f":"IF(ISBLANK(#REF!),\"\",#REF!)","v":{"$error":"#REF!"}}]
[15.7675,24.300500000000003,26.897500000000001,{"$f":"IF(ISBLANK(#REF!),\"\",#REF!)","v":{"$error":"#REF!"}},{"$f":"IF(ISBLANK(#REF!),\"\",#REF!)","v":{"$error":"#REF!"}}]
[16.2775,25.086500000000001,27.767499999999998,{"$f":"IF(ISBLANK(#REF!),\"\",#REF!)","v":{"$error":"#REF!"}},{"$f":"IF(ISBLANK(#REF!),\"\",#REF!)","v":{"$error":"#REF!"}}]
[16.681249999999999,25.708749999999998,28.456250000000001,{"$f":"IF(ISBLANK(#REF!),\"\",#REF!)","v":{"$error":"#REF!"}},{"$f":"IF(ISBLANK(#REF!),\"\",#REF!)","v":{"$error":"#REF!"}}]
[16.914999999999999,26.068999999999999,28.855,{"$f":"IF(ISBLANK(#REF!),\"\",#REF!)","v":{"$error":"#REF!"}},{"$f":"IF(ISBLANK(#REF!),\"\",#REF!)","v":{"$error":"#REF!"}}]
[17.106249999999999,26.36375,29.181249999999999,{"$f":"IF(ISBLANK(#REF!),\"\",#REF!)","v":{"$error":"#REF!"}},{"$f":"IF(ISBLANK(#REF!),\"\",#REF!)","v":{"$error":"#REF!"}}]
[17.276250000000001,26.625750000000004,29.471250000000001,{"$f":"IF(ISBLANK(#REF!),\"\",#REF!)","v":{"$error":"#REF!"}},{"$f":"IF(ISBLANK(#REF!),\"\",#REF!)","v":{"$error":"#REF!"}}]
[17.3825,26.7895,29.6525,{"$f":"IF(ISBLANK(#REF!),\"\",#REF!)","v":{"$error":"#REF!"}},{"$f":"IF(ISBLANK(#REF!),\"\",#REF!)","v":{"$error":"#REF!"}}]
[17.446249999999999,26.88775,29.76125,{"$f":"IF(ISBLANK(#REF!),\"\",#REF!)","v":{"$error":"#REF!"}},{"$f":"IF(ISBLANK(#REF!),\"\",#REF!)","v":{"$error":"#REF!"}}]
[17.510000000000002,26.986000000000004,29.87,{"$f":"IF(ISBLANK(#REF!),\"\",#REF!)","v":{"$error":"#REF!"}},{"$f":"IF(ISBLANK(#REF!),\"\",#REF!)","v":{"$error":"#REF!"}}]
[null,null,null,{"$f":"IF(ISBLANK(#REF!),\"\",#REF!)","v":{"$error":"#REF!"}},{"$f":"IF(ISBLANK(#REF!),\"\",#REF!)","v":{"$error":"#REF!"}}]
[null,null,null,{"$f":"IF(ISBLANK(#REF!),\"\",#REF!)","v":{"$error":"#REF!"}},{"$f":"IF(ISBLANK(#REF!),\"\",#REF!)","v":{"$error":"#REF!"}}]
[null,null,null,{"$f":"IF(ISBLANK(#REF!),\"\",#REF!)","v":{"$error":"#REF!"}},{"$f":"IF(ISBLANK(#REF!),\"\",#REF!)","v":{"$error":"#REF!"}}]
[null,null,null,{"$f":"IF(ISBLANK(#REF!),\"\",#REF!)","v":{"$error":"#REF!"}},{"$f":"IF(ISBLANK(#REF!),\"\",#REF!)","v":{"$error":"#REF!"}}]
[null,null,null,{"$f":"IF(ISBLANK(#REF!),\"\",#REF!)","v":{"$error":"#REF!"}},{"$f":"IF(ISBLANK(#REF!),\"\",#REF!)","v":{"$error":"#REF!"}}]
[null,null,null,{"$f":"IF(ISBLANK(#REF!),\"\",#REF!)","v":{"$error":"#REF!"}},{"$f":"IF(ISBLANK(#REF!),\"\",#REF!)","v":{"$error":"#REF!"}}]
[null,null,null,{"$f":"IF(ISBLANK(#REF!),\"\",#REF!)","v":{"$error":"#REF!"}},{"$f":"IF(ISBLANK(#REF!),\"\",#REF!)","v":{"$error":"#REF!"}}]
[null,null,null,{"$f":"IF(ISBLANK(#REF!),\"\",#REF!)","v":{"$error":"#REF!"}},{"$f":"IF(ISBLANK(#REF!),\"\",#REF!)","v":{"$error":"#REF!"}}]
[null,null,null,{"$f":"IF(ISBLANK(#REF!),\"\",#REF!)","v":{"$error":"#REF!"}},{"$f":"IF(ISBLANK(#REF!),\"\",#REF!)","v":{"$error":"#REF!"}}]
[null,null,null,{"$f":"IF(ISBLANK(#REF!),\"\",#REF!)","v":{"$error":"#REF!"}},{"$f":"IF(ISBLANK(#REF!),\"\",#REF!)","v":{"$error":"#REF!"}}]
[null,null,null,{"$f":"IF(ISBLANK(#REF!),\"\",#REF!)","v":{"$error":"#REF!"}},{"$f":"IF(ISBLANK(#REF!),\"\",#REF!)","v":{"$error":"#REF!"}}]
[null,null,null,{"$f":"IF(ISBLANK(#REF!),\"\",#REF!)","v":{"$error":"#REF!"}},{"$f":"IF(ISBLANK(#REF!),\"\",#REF!)","v":{"$error":"#REF!"}}]
[null,null,null,{"$f":"IF(ISBLANK(#REF!),\"\",#REF!)","v":{"$error":"#REF!"}},{"$f":"IF(ISBLANK(#REF!),\"\",#REF!)","v":{"$error":"#REF!"}}]
[null,null,null,{"$f":"IF(ISBLANK(#REF!),\"\",#REF!)","v":{"$error":"#REF!"}},{"$f":"IF(ISBLANK(#REF!),\"\",#REF!)","v":{"$error":"#REF!"}}]
[null,null,null,{"$f":"IF(ISBLANK(#REF!),\"\",#REF!)","v":{"$error":"#REF!"}},{"$f":"IF(ISBLANK(#REF!),\"\",#REF!)","v":{"$error":"#REF!"}}]
[null,null,null,{"$f":"IF(ISBLANK(#REF!),\"\",#REF!)","v":{"$error":"#REF!"}},{"$f":"IF(ISBLANK(#REF!),\"\",#REF!)","v":{"$error":"#REF!"}}]
[null,null,null,{"$f":"IF(ISBLANK(#REF!),\"\",#REF!)","v":{"$error":"#REF!"}},{"$f":"IF(ISBLANK(#REF!),\"\",#REF!)","v":{"$error":"#REF!"}}]
[null,null,null,{"$f":"IF(ISBLANK(#REF!),\"\",#REF!)","v":{"$error":"#REF!"}},{"$f":"IF(ISBLANK(#REF!),\"\",#REF!)","v":{"$error":"#REF!"}}]
[null,null,null,{"$f":"IF(ISBLANK(#REF!),\"\",#REF!)","v":{"$error":"#REF!"}},{"$f":"IF(ISBLANK(#REF!),\"\",#REF!)","v":{"$error":"#REF!"}}]
[null,null,null,{"$f":"IF(ISBLANK(#REF!),\"\",#REF!)","v":{"$error":"#REF!"}},{"$f":"IF(ISBLANK(#REF!),\"\",#REF!)","v":{"$error":"#REF!"}}]
[null,null,null,{"$f":"IF(ISBLANK(#REF!),\"\",#REF!)","v":{"$error":"#REF!"}},{"$f":"IF(ISBLANK(#REF!),\"\",#REF!)","v":{"$error":"#REF!"}}]
[null,null,null,{"$f":"IF(ISBLANK(#REF!),\"\",#REF!)","v":{"$error":"#REF!"}},{"$f":"IF(ISBLANK(#REF!),\"\",#REF!)","v":{"$error":"#REF!"}}]
[null,null,null,{"$f":"IF(ISBLANK(#REF!),\"\",#REF!)","v":{"$error":"#REF!"}},{"$f":"IF(ISBLANK(#REF!),\"\",#REF!)","v":{"$error":"#REF!"}}]
[null,null,null,{"$f":"IF(ISBLANK(#REF!),\"\",#REF!)","v":{"$error":"#REF!"}},{"$f":"IF(ISBLANK(#REF!),\"\",#REF!)","v":{"$error":"#REF!"}}]
[null,null,null,{"$f":"IF(ISBLANK(#REF!),\"\",#REF!)","v":{"$error":"#REF!"}},{"$f":"IF(ISBLANK(#REF!),\"\",#REF!)","v":{"$error":"#REF!"}}]
[null,null,null,{"$f":"IF(ISBLANK(#REF!),\"\",#REF!)","v":{"$error":"#REF!"}},{"$f":"IF(ISBLANK(#REF!),\"\",#REF!)","v":{"$error":"#REF!"}}]
[null,null,null,{"$f":"IF(ISBLANK(#REF!),\"\",#REF!)","v":{"$error":"#REF!"}},{"$f":"IF(ISBLANK(#REF!),\"\",#REF!)","v":{"$error":"#REF!"}}]
[null,null,null,{"$f":"IF(ISBLANK(#REF!),\"\",#REF!)","v":{"$error":"#REF!"}},{"$f":"IF(ISBLANK(#REF!),\"\",#REF!)","v":{"$error":"#REF!"}}]
[null,null,null,{"$f":"IF(ISBLANK(#REF!),\"\",#REF!)","v":{"$error":"#REF!"}},{"$f":"IF(ISBLANK(#REF!),\"\",#REF!)","v":{"$error":"#REF!"}}]
[null,null,null,{"$f":"IF(ISBLANK(#REF!),\"\",#REF!)","v":{"$error":"#REF!"}},{"$f":"IF(ISBLANK(#REF!),\"\",#REF!)","v":{"$error":"#REF!"}}]
[null,null,null,{"$f":"IF(ISBLANK(#REF!),\"\",#REF!)","v":{"$error":"#REF!"}},{"$f":"IF(ISBLANK(#REF!),\"\",#REF!)","v":{"$error":"#REF!"}}]
[null,null,null,{"$f":"IF(ISBLANK(#REF!),\"\",#REF!)","v":{"$error":"#REF!"}},{"$f":"IF(ISBLANK(#REF!),\"\",#REF!)","v":{"$error":"#REF!"}}]
[null,null,null,{"$f":"IF(ISBLANK(#REF!),\"\",#REF!)","v":{"$error":"#REF!"}},{"$f":"IF(ISBLANK(#REF!),\"\",#REF!)","v":{"$error":"#REF!"}}]
[null,null,null,{"$f":"IF(ISBLANK(#REF!),\"\",#REF!)","v":{"$error":"#REF!"}},{"$f":"IF(ISBLANK(#REF!),\"\",#REF!)","v":{"$error":"#REF!"}}]
[null,null,null,{"$f":"IF(ISBLANK(#REF!),\"\",#REF!)","v":{"$error":"#REF!"}},{"$f":"IF(ISBLANK(#REF!),\"\",#REF!)","v":{"$error":"#REF!"}}]
[null,null,null,{"$f":"IF(ISBLANK(#REF!),\"\",#REF!)","v":{"$error":"#REF!"}},{"$f":"IF(ISBLANK(#REF!),\"\",#REF!)","v":{"$error":"#REF!"}}]
[null,null,null,{"$f":"IF(ISBLANK(#REF!),\"\",#REF!)","v":{"$error":"#REF!"}},{"$f":"IF(ISBLANK(#REF!),\"\",#REF!)","v":{"$error":"#REF!"}}]
[null,null,null,{"$f":"IF(ISBLANK(#REF!),\"\",#REF!)","v":{"$error":"#REF!"}},{"$f":"IF(ISBLANK(#REF!),\"\",#REF!)","v":{"$error":"#REF!"}}]
[null,null,null,{"$f":"IF(ISBLANK(#REF!),\"\",#REF!)","v":{"$error":"#REF!"}},{"$f":"IF(ISBLANK(#REF!),\"\",#REF!)","v":{"$error":"#REF!"}}]
[null,null,null,{"$f":"IF(ISBLANK(#REF!),\"\",#REF!)","v":{"$error":"#REF!"}},{"$f":"IF(ISBLANK(#REF!),\"\",#REF!)","v":{"$error":"#REF!"}}]
[null,null,null,{"$f":"IF(ISBLANK(#REF!),\"\",#REF!)","v":{"$error":"#REF!"}},{"$f":"IF(ISBLANK(#REF!),\"\",#REF!)","v":{"$error":"#REF!"}}]
[null,null,null,{"$f":"IF(ISBLANK(#REF!),\"\",#REF!)","v":{"$error":"#REF!"}},{"$f":"IF(ISBLANK(#REF!),\"\",#REF!)","v":{"$error":"#REF!"}}]
[null,null,null,{"$f":"IF(ISBLANK(#REF!),\"\",#REF!)","v":{"$error":"#REF!"}},{"$f":"IF(ISBLANK(#REF!),\"\",#REF!)","v":{"$error":"#REF!"}}]
[null,null,null,{"$f":"IF(ISBLANK(#REF!),\"\",#REF!)","v":{"$error":"#REF!"}},{"$f":"IF(ISBLANK(#REF!),\"\",#REF!)","v":{"$error":"#REF!"}}]
[null,null,null,{"$f":"IF(ISBLANK(#REF!),\"\",#REF!)","v":{"$error":"#REF!"}},{"$f":"IF(ISBLANK(#REF!),\"\",#REF!)","v":{"$error":"#REF!"}}]
[null,null,null,{"$f":"IF(ISBLANK(#REF!),\"\",#REF!)","v":{"$error":"#REF!"}},{"$f":"IF(ISBLANK(#REF!),\"\",#REF!)","v":{"$error":"#REF!"}}]
[null,null,null,{"$f":"IF(ISBLANK(#REF!),\"\",#REF!)","v":{"$error":"#REF!"}},{"$f":"IF(ISBLANK(#REF!),\"\",#REF!)","v":{"$error":"#REF!"}}]
[null,null,null,{"$f":"IF(ISBLANK(#REF!),\"\",#REF!)","v":{"$error":"#REF!"}},{"$f":"IF(ISBLANK(#REF!),\"\",#REF!)","v":{"$error":"#REF!"}}]
[null,null,null,{"$f":"IF(ISBLANK(#REF!),\"\",#REF!)","v":{"$error":"#REF!"}},{"$f":"IF(ISBLANK(#REF!),\"\",#REF!)","v":{"$error":"#REF!"}}]
[null,null,null,{"$f":"IF(ISBLANK(#REF!),\"\",#REF!)","v":{"$error":"#REF!"}},{"$f":"IF(ISBLANK(#REF!),\"\",#REF!)","v":{"$error":"#REF!"}}]
[null,null,null,{"$f":"IF(ISBLANK(#REF!),\"\",#REF!)","v":{"$error":"#REF!"}},{"$f":"IF(ISBLANK(#REF!),\"\",#REF!)","v":{"$error":"#REF!"}}]
[null,null,null,{"$f":"IF(ISBLANK(#REF!),\"\",#REF!)","v":{"$error":"#REF!"}},{"$f":"IF(ISBLANK(#REF!),\"\",#REF!)","v":{"$error":"#REF!"}}]
[null,null,null,{"$f":"IF(ISBLANK(#REF!),\"\",#REF!)","v":{"$error":"#REF!"}},{"$f":"IF(ISBLANK(#REF!),\"\",#REF!)","v":{"$error":"#REF!"}}]
[null,null,null,{"$f":"IF(ISBLANK(#REF!),\"\",#REF!)","v":{"$error":"#REF!"}},{"$f":"IF(ISBLANK(#REF!),\"\",#REF!)","v":{"$error":"#REF!"}}]
[null,null,null,{"$f":"IF(ISBLANK(#REF!),\"\",#REF!)","v":{"$error":"#REF!"}},{"$f":"IF(ISBLANK(#REF!),\"\",#REF!)","v":{"$error":"#REF!"}}]
[null,null,null,{"$f":"IF(ISBLANK(#REF!),\"\",#REF!)","v":{"$error":"#REF!"}},{"$f":"IF(ISBLANK(#REF!),\"\",#REF!)","v":{"$error":"#REF!"}}]
[null,null,null,{"$f":"IF(ISBLANK(#REF!),\"\",#REF!)","v":{"$error":"#REF!"}},{"$f":"IF(ISBLANK(#REF!),\"\",#REF!)","v":{"$error":"#REF!"}}]
[null,null,null,{"$f":"IF(ISBLANK(#REF!),\"\",#REF!)","v":{"$error":"#REF!"}},{"$f":"IF(ISBLANK(#REF!),\"\",#REF!)","v":{"$error":"#REF!"}}]
[null,null,null,{"$f":"IF(ISBLANK(#REF!),\"\",#REF!)","v":{"$error":"#REF!"}},{"$f":"IF(ISBLANK(#REF!),\"\",#REF!)","v":{"$error":"#REF!"}}]
[null,null,null,{"$f":"IF(ISBLANK(#REF!),\"\",#REF!)","v":{"$error":"#REF!"}},{"$f":"IF(ISBLANK(#REF!),\"\",#REF!)","v":{"$error":"#REF!"}}]
[null,null,null,{"$f":"IF(ISBLANK(#REF!),\"\",#REF!)","v":{"$error":"#REF!"}},{"$f":"IF(ISBLANK(#REF!),\"\",#REF!)","v":{"$error":"#REF!"}}]
[null,null,null,{"$f":"IF(ISBLANK(#REF!),\"\",#REF!)","v":{"$error":"#REF!"}},{"$f":"IF(ISBLANK(#REF!),\"\",#REF!)","v":{"$error":"#REF!"}}]
[null,null,null,{"$f":"IF(ISBLANK(#REF!),\"\",#REF!)","v":{"$error":"#REF!"}},{"$f":"IF(ISBLANK(#REF!),\"\",#REF!)","v":{"$error":"#REF!"}}]
[null,null,null,{"$f":"IF(ISBLANK(#REF!),\"\",#REF!)","v":{"$error":"#REF!"}},{"$f":"IF(ISBLANK(#REF!),\"\",#REF!)","v":{"$error":"#REF!"}}]
[null,null,null,{"$f":"IF(ISBLANK(#REF!),\"\",#REF!)","v":{"$error":"#REF!"}},{"$f":"IF(ISBLANK(#REF!),\"\",#REF!)","v":{"$error":"#REF!"}}]
[null,null,null,{"$f":"IF(ISBLANK(#REF!),\"\",#REF!)","v":{"$error":"#REF!"}},{"$f":"IF(ISBLANK(#REF!),\"\",#REF!)","v":{"$error":"#REF!"}}]
[null,null,null,{"$f":"IF(ISBLANK(#REF!),\"\",#REF!)","v":{"$error":"#REF!"}},{"$f":"IF(ISBLANK(#REF!),\"\",#REF!)","v":{"$error":"#REF!"}}]
[null,null,null,{"$f":"IF(ISBLANK(#REF!),\"\",#REF!)","v":{"$error":"#REF!"}},{"$f":"IF(ISBLANK(#REF!),\"\",#REF!)","v":{"$error":"#REF!"}}]
[null,null,null,{"$f":"IF(ISBLANK(#REF!),\"\",#REF!)","v":{"$error":"#REF!"}},{"$f":"IF(ISBLANK(#REF!),\"\",#REF!)","v":{"$error":"#REF!"}}]
[null,null,null,{"$f":"IF(ISBLANK(#REF!),\"\",#REF!)","v":{"$error":"#REF!"}},{"$f":"IF(ISBLANK(#REF!),\"\",#REF!)","v":{"$error":"#REF!"}}]
[null,null,null,{"$f":"IF(ISBLANK(#REF!),\"\",#REF!)","v":{"$error":"#REF!"}},{"$f":"IF(ISBLANK(#REF!),\"\",#REF!)","v":{"$error":"#REF!"}}]
[null,null,null,{"$f":"IF(ISBLANK(#REF!),\"\",#REF!)","v":{"$error":"#REF!"}},{"$f":"IF(ISBLANK(#REF!),\"\",#REF!)","v":{"$error":"#REF!"}}]
[null,null,null,{"$f":"IF(ISBLANK(#REF!),\"\",#REF!)","v":{"$error":"#REF!"}},{"$f":"IF(ISBLANK(#REF!),\"\",#REF!)","v":{"$error":"#REF!"}}]
[null,null,null,{"$f":"IF(ISBLANK(#REF!),\"\",#REF!)","v":{"$error":"#REF!"}},{"$f":"IF(ISBLANK(#REF!),\"\",#REF!)","v":{"$error":"#REF!"}}]
[null,null,null,{"$f":"IF(ISBLANK(#REF!),\"\",#REF!)","v":{"$error":"#REF!"}},{"$f":"IF(ISBLANK(#REF!),\"\",#REF!)","v":{"$error":"#REF!"}}]
[null,null,null,{"$f":"IF(ISBLANK(#REF!),\"\",#REF!)","v":{"$error":"#REF!"}},{"$f":"IF(ISBLANK(#REF!),\"\",#REF!)","v":{"$error":"#REF!"}}]
[null,null,null,{"$f":"IF(ISBLANK(#REF!),\"\",#REF!)","v":{"$error":"#REF!"}},{"$f":"IF(ISBLANK(#REF!),\"\",#REF!)","v":{"$error":"#REF!"}}]
[null,null,null,{"$f":"IF(ISBLANK(#REF!),\"\",#REF!)","v":{"$error":"#REF!"}},{"$f":"IF(ISBLANK(#REF!),\"\",#REF!)","v":{"$error":"#REF!"}}]
[null,null,null,{"$f":"IF(ISBLANK(#REF!),\"\",#REF!)","v":{"$error":"#REF!"}},{"$f":"IF(ISBLANK(#REF!),\"\",#REF!)","v":{"$error":"#REF!"}}]
[null,null,null,{"$f":"IF(ISBLANK(#REF!),\"\",#REF!)","v":{"$error":"#REF!"}},{"$f":"IF(ISBLANK(#REF!),\"\",#REF!)","v":{"$error":"#REF!"}}]
[null,null,null,{"$f":"IF(ISBLANK(#REF!),\"\",#REF!)","v":{"$error":"#REF!"}},{"$f":"IF(ISBLANK(#REF!),\"\",#REF!)","v":{"$error":"#REF!"}}]
[null,null,null,{"$f":"IF(ISBLANK(#REF!),\"\",#REF!)","v":{"$error":"#REF!"}},{"$f":"IF(ISBLANK(#REF!),\"\",#REF!)","v":{"$error":"#REF!"}}]
[null,null,null,{"$f":"IF(ISBLANK(#REF!),\"\",#REF!)","v":{"$error":"#REF!"}},{"$f":"IF(ISBLANK(#REF!),\"\",#REF!)","v":{"$error":"#REF!"}}]
[null,null,null,{"$f":"IF(ISBLANK(#REF!),\"\",#REF!)","v":{"$error":"#REF!"}},{"$f":"IF(ISBLANK(#REF!),\"\",#REF!)","v":{"$error":"#REF!"}}]
[null,null,null,{"$f":"IF(ISBLANK(#REF!),\"\",#REF!)","v":{"$error":"#REF!"}},{"$f":"IF(ISBLANK(#REF!),\"\",#REF!)","v":{"$error":"#REF!"}}]
[null,null,null,{"$f":"IF(ISBLANK(#REF!),\"\",#REF!)","v":{"$error":"#REF!"}},{"$f":"IF(ISBLANK(#REF!),\"\",#REF!)","v":{"$error":"#REF!"}}]
[null,null,null,{"$f":"IF(ISBLANK(#REF!),\"\",#REF!)","v":{"$error":"#REF!"}},{"$f":"IF(ISBLANK(#REF!),\"\",#REF!)","v":{"$error":"#REF!"}}]
[null,null,null,{"$f":"IF(ISBLANK(#REF!),\"\",#REF!)","v":{"$error":"#REF!"}},{"$f":"IF(ISBLANK(#REF!),\"\",#REF!)","v":{"$error":"#REF!"}}]
[null,null,null,{"$f":"IF(ISBLANK(#REF!),\"\",#REF!)","v":{"$error":"#REF!"}},{"$f":"IF(ISBLANK(#REF!),\"\",#REF!)","v":{"$error":"#REF!"}}]
[null,null,null,{"$f":"IF(ISBLANK(#REF!),\"\",#REF!)","v":{"$error":"#REF!"}},{"$f":"IF(ISBLANK(#REF!),\"\",#REF!)","v":{"$error":"#REF!"}}]
[null,null,null,{"$f":"IF(ISBLANK(#REF!),\"\",#REF!)","v":{"$error":"#REF!"}},{"$f":"IF(ISBLANK(#REF!),\"\",#REF!)","v":{"$error":"#REF!"}}]
[null,null,null,{"$f":"IF(ISBLANK(#REF!),\"\",#REF!)","v":{"$error":"#REF!"}},{"$f":"IF(ISBLANK(#REF!),\"\",#REF!)","v":{"$error":"#REF!"}}]
[null,null,null,{"$f":"IF(ISBLANK(#REF!),\"\",#REF!)","v":{"$error":"#REF!"}},{"$f":"IF(ISBLANK(#REF!),\"\",#REF!)","v":{"$error":"#REF!"}}]
[null,null,null,{"$f":"IF(ISBLANK(#REF!),\"\",#REF!)","v":{"$error":"#REF!"}},{"$f":"IF(ISBLANK(#REF!),\"\",#REF!)","v":{"$error":"#REF!"}}]
[null,null,null,{"$f":"IF(ISBLANK(#REF!),\"\",#REF!)","v":{"$error":"#REF!"}},{"$f":"IF(ISBLANK(#REF!),\"\",#REF!)","v":{"$error":"#REF!"}}]
[null,null,null,{"$f":"IF(ISBLANK(#REF!),\"\",#REF!)","v":{"$error":"#REF!"}},{"$f":"IF(ISBLANK(#REF!),\"\",#REF!)","v":{"$error":"#REF!"}}]
[null,null,null,{"$f":"IF(ISBLANK(#REF!),\"\",#REF!)","v":{"$error":"#REF!"}},{"$f":"IF(ISBLANK(#REF!),\"\",#REF!)","v":{"$error":"#REF!"}}]
[null,null,null,{"$f":"IF(ISBLANK(#REF!),\"\",#REF!)","v":{"$error":"#REF!"}},{"$f":"IF(ISBLANK(#REF!),\"\",#REF!)","v":{"$error":"#REF!"}}]
[null,null,null,{"$f":"IF(ISBLANK(#REF!),\"\",#REF!)","v":{"$error":"#REF!"}},{"$f":"IF(ISBLANK(#REF!),\"\",#REF!)","v":{"$error":"#REF!"}}]

{"sheet":"Synthèse","index":11,"n_rows":30,"n_cols":22,"rows_kept":30,"cut":false,"hidden":false,"merged":[]}
["Synthèse"]
[]
["Désir de maigrir","Critiques/ corps","Restrictions","Orthorexie","Perfectionnisme","Dépression","Anxiété","Impulsivité","Hypercontrôle","Inhibition","Vie sociale","Estime faible","Evit. Maturité","Réticence"]
[{"$f":"SUM(Archive1!$J$16:$J$21)","v":0},{"$f":"SUM(Archive1!$J$22:$J$27)","v":0},{"$f":"SUM(Archive1!$J$28:$J$33)","v":0},{"$f":"SUM(Archive1!$J$34:$J$39)","v":0},{"$f":"SUM(Archive1!$J$40:$J$45)","v":0},{"$f":"SUM(Archive1!$J$46:$J$51)","v":0},{"$f":"SUM(Archive1!$J$52:$J$57)","v":0},{"$f":"SUM(Archive1!$J$58:$J$63)","v":0},{"$f":"SUM(Archive1!$J$64:$J$69)","v":0},{"$f":"SUM(Archive1!$J$70:$J$75)","v":0},{"$f":"SUM(Archive1!$J$76:$J$81)","v":0},{"$f":"SUM(Archive1!$J$82:$J$87)","v":0},{"$f":"SUM(Archive1!$J$88:$J$93)","v":0},{"$f":"SUM(Archive1!$J$94:$J$99)","v":0}]
[{"$f":"SUM(Archive2!$J$16:$J$21)","v":0},{"$f":"SUM(Archive2!$J$22:$J$27)","v":0},{"$f":"SUM(Archive2!$J$28:$J$33)","v":0},{"$f":"SUM(Archive2!$J$34:$J$39)","v":0},{"$f":"SUM(Archive2!$J$40:$J$45)","v":0},{"$f":"SUM(Archive2!$J$46:$J$51)","v":0},{"$f":"SUM(Archive2!$J$52:$J$57)","v":0},{"$f":"SUM(Archive2!$J$58:$J$63)","v":0},{"$f":"SUM(Archive2!$J$64:$J$69)","v":0},{"$f":"SUM(Archive2!$J$70:$J$75)","v":0},{"$f":"SUM(Archive2!$J$76:$J$81)","v":0},{"$f":"SUM(Archive2!$J$82:$J$87)","v":0},{"$f":"SUM(Archive2!$J$88:$J$93)","v":0},{"$f":"SUM(Archive2!$J$94:$J$99)","v":0}]
[{"$f":"SUM(Archive3!$J$16:$J$21)","v":0},{"$f":"SUM(Archive3!$J$22:$J$27)","v":0},{"$f":"SUM(Archive3!$J$28:$J$33)","v":0},{"$f":"SUM(Archive3!$J$34:$J$39)","v":0},{"$f":"SUM(Archive3!$J$40:$J$45)","v":0},{"$f":"SUM(Archive3!$J$46:$J$51)","v":0},{"$f":"SUM(Archive3!$J$52:$J$57)","v":0},{"$f":"SUM(Archive3!$J$58:$J$63)","v":0},{"$f":"SUM(Archive3!$J$64:$J$69)","v":0},{"$f":"SUM(Archive3!$J$70:$J$75)","v":0},{"$f":"SUM(Archive3!$J$76:$J$81)","v":0},{"$f":"SUM(Archive3!$J$82:$J$87)","v":0},{"$f":"SUM(Archive3!$J$88:$J$93)","v":0},{"$f":"SUM(Archive3!$J$94:$J$99)","v":0}]
[{"$f":"SUM(Archive4!$J$16:$J$21)","v":0},{"$f":"SUM(Archive4!$J$22:$J$27)","v":0},{"$f":"SUM(Archive4!$J$28:$J$33)","v":0},{"$f":"SUM(Archive4!$J$34:$J$39)","v":0},{"$f":"SUM(Archive4!$J$40:$J$45)","v":0},{"$f":"SUM(Archive4!$J$46:$J$51)","v":0},{"$f":"SUM(Archive4!$J$52:$J$57)","v":0},{"$f":"SUM(Archive4!$J$58:$J$63)","v":0},{"$f":"SUM(Archive4!$J$64:$J$69)","v":0},{"$f":"SUM(Archive4!$J$70:$J$75)","v":0},{"$f":"SUM(Archive4!$J$76:$J$81)","v":0},{"$f":"SUM(Archive4!$J$82:$J$87)","v":0},{"$f":"SUM(Archive4!$J$88:$J$93)","v":0},{"$f":"SUM(Archive4!$J$94:$J$99)","v":0}]
[{"$f":"SUM(Archive5!$J$16:$J$21)","v":0},{"$f":"SUM(Archive5!$J$22:$J$27)","v":0},{"$f":"SUM(Archive5!$J$28:$J$33)","v":0},{"$f":"SUM(Archive5!$J$34:$J$39)","v":0},{"$f":"SUM(Archive5!$J$40:$J$45)","v":0},{"$f":"SUM(Archive5!$J$46:$J$51)","v":0},{"$f":"SUM(Archive5!$J$52:$J$57)","v":0},{"$f":"SUM(Archive5!$J$58:$J$63)","v":0},{"$f":"SUM(Archive5!$J$64:$J$69)","v":0},{"$f":"SUM(Archive5!$J$70:$J$75)","v":0},{"$f":"SUM(Archive5!$J$76:$J$81)","v":0},{"$f":"SUM(Archive5!$J$82:$J$87)","v":0},{"$f":"SUM(Archive5!$J$88:$J$93)","v":0},{"$f":"SUM(Archive5!$J$94:$J$99)","v":0}]
[]
[]
["Résultats en %"]
[]
[{"$f":" A4/24","v":0},{"$f":" B4/24","v":0},0,0,0,0,0,0,0,0,0,0,0,0]
[{"$f":" A5/24","v":0},0,0,0,0,0,0,0,0,0,0,0,0,0]
[{"$f":" A6/24","v":0},0,0,0,0,0,0,0,0,0,0,0,0,0]
[{"$f":" A7/24","v":0},0,0,0,0,0,0,0,0,0,0,0,0,0]
[{"$f":" A8/24","v":0},0,0,0,0,0,0,0,0,0,0,0,0,0]
[]
[]
["Silhouette","Cheveux","Visage","Yeux","Nez","Bouche","Cou","Epaules","Bras","Avant-bras","Mains","Dos","Poitrine","Hanches","Ventre","Fesses","Cuisses","Genoux","Mollets","Pieds","Peau","Musculature"]
[{"$f":"Archive1!O4","v":0},{"$f":"Archive1!P4","v":0},{"$f":"Archive1!Q4","v":0},{"$f":"Archive1!R4","v":0},{"$f":"Archive1!S4","v":0},{"$f":"Archive1!T4","v":0},{"$f":"Archive1!U4","v":0},{"$f":"Archive1!V4","v":0},{"$f":"Archive1!W4","v":0},{"$f":"Archive1!X4","v":0},{"$f":"Archive1!Y4","v":0},{"$f":"Archive1!Z4","v":0},{"$f":"Archive1!AA4","v":0},{"$f":"Archive1!AB4","v":0},{"$f":"Archive1!AC4","v":0},{"$f":"Archive1!AD4","v":0},{"$f":"Archive1!AE4","v":0},{"$f":"Archive1!AF4","v":0},{"$f":"Archive1!AG4","v":0},{"$f":"Archive1!AH4","v":0},{"$f":"Archive1!AI4","v":0},{"$f":"Archive1!AJ4","v":0}]
[{"$f":"Archive1!O5","v":0},{"$f":"Archive1!P5","v":0},{"$f":"Archive1!Q5","v":0},{"$f":"Archive1!R5","v":0},{"$f":"Archive1!S5","v":0},{"$f":"Archive1!T5","v":0},{"$f":"Archive1!U5","v":0},{"$f":"Archive1!V5","v":0},{"$f":"Archive1!W5","v":0},{"$f":"Archive1!X5","v":0},{"$f":"Archive1!Y5","v":0},{"$f":"Archive1!Z5","v":0},{"$f":"Archive1!AA5","v":0},{"$f":"Archive1!AB5","v":0},{"$f":"Archive1!AC5","v":0},{"$f":"Archive1!AD5","v":0},{"$f":"Archive1!AE5","v":0},{"$f":"Archive1!AF5","v":0},{"$f":"Archive1!AG5","v":0},{"$f":"Archive1!AH5","v":0},{"$f":"Archive1!AI5","v":0},{"$f":"Archive1!AJ5","v":0}]
[{"$f":"Archive2!O4","v":0},{"$f":"Archive2!P4","v":0},{"$f":"Archive2!Q4","v":0},{"$f":"Archive2!R4","v":0},{"$f":"Archive2!S4","v":0},{"$f":"Archive2!T4","v":0},{"$f":"Archive2!U4","v":0},{"$f":"Archive2!V4","v":0},{"$f":"Archive2!W4","v":0},{"$f":"Archive2!X4","v":0},{"$f":"Archive2!Y4","v":0},{"$f":"Archive2!Z4","v":0},{"$f":"Archive2!AA4","v":0},{"$f":"Archive2!AB4","v":0},{"$f":"Archive2!AC4","v":0},{"$f":"Archive2!AD4","v":0},{"$f":"Archive2!AE4","v":0},{"$f":"Archive2!AF4","v":0},{"$f":"Archive2!AG4","v":0},{"$f":"Archive2!AH4","v":0},{"$f":"Archive2!AI4","v":0},{"$f":"Archive2!AJ4","v":0}]
[{"$f":"Archive2!O5","v":0},{"$f":"Archive2!P5","v":0},{"$f":"Archive2!Q5","v":0},{"$f":"Archive2!R5","v":0},{"$f":"Archive2!S5","v":0},{"$f":"Archive2!T5","v":0},{"$f":"Archive2!U5","v":0},{"$f":"Archive2!V5","v":0},{"$f":"Archive2!W5","v":0},{"$f":"Archive2!X5","v":0},{"$f":"Archive2!Y5","v":0},{"$f":"Archive2!Z5","v":0},{"$f":"Archive2!AA5","v":0},{"$f":"Archive2!AB5","v":0},{"$f":"Archive2!AC5","v":0},{"$f":"Archive2!AD5","v":0},{"$f":"Archive2!AE5","v":0},{"$f":"Archive2!AF5","v":0},{"$f":"Archive2!AG5","v":0},{"$f":"Archive2!AH5","v":0},{"$f":"Archive2!AI5","v":0},{"$f":"Archive2!AJ5","v":0}]
[{"$f":"Archive3!O4","v":0},{"$f":"Archive3!P4","v":0},{"$f":"Archive3!Q4","v":0},{"$f":"Archive3!R4","v":0},{"$f":"Archive3!S4","v":0},{"$f":"Archive3!T4","v":0},{"$f":"Archive3!U4","v":0},{"$f":"Archive3!V4","v":0},{"$f":"Archive3!W4","v":0},{"$f":"Archive3!X4","v":0},{"$f":"Archive3!Y4","v":0},{"$f":"Archive3!Z4","v":0},{"$f":"Archive3!AA4","v":0},{"$f":"Archive3!AB4","v":0},{"$f":"Archive3!AC4","v":0},{"$f":"Archive3!AD4","v":0},{"$f":"Archive3!AE4","v":0},{"$f":"Archive3!AF4","v":0},{"$f":"Archive3!AG4","v":0},{"$f":"Archive3!AH4","v":0},{"$f":"Archive3!AI4","v":0},{"$f":"Archive3!AJ4","v":0}]
[{"$f":"Archive3!O5","v":0},{"$f":"Archive3!P5","v":0},{"$f":"Archive3!Q5","v":0},{"$f":"Archive3!R5","v":0},{"$f":"Archive3!S5","v":0},{"$f":"Archive3!T5","v":0},{"$f":"Archive3!U5","v":0},{"$f":"Archive3!V5","v":0},{"$f":"Archive3!W5","v":0},{"$f":"Archive3!X5","v":0},{"$f":"Archive3!Y5","v":0},{"$f":"Archive3!Z5","v":0},{"$f":"Archive3!AA5","v":0},{"$f":"Archive3!AB5","v":0},{"$f":"Archive3!AC5","v":0},{"$f":"Archive3!AD5","v":0},{"$f":"Archive3!AE5","v":0},{"$f":"Archive3!AF5","v":0},{"$f":"Archive3!AG5","v":0},{"$f":"Archive3!AH5","v":0},{"$f":"Archive3!AI5","v":0},{"$f":"Archive3!AJ5","v":0}]
[{"$f":"Archive4!O4","v":0},{"$f":"Archive4!P4","v":0},{"$f":"Archive4!Q4","v":0},{"$f":"Archive4!R4","v":0},{"$f":"Archive4!S4","v":0},{"$f":"Archive4!T4","v":0},{"$f":"Archive4!U4","v":0},{"$f":"Archive4!V4","v":0},{"$f":"Archive4!W4","v":0},{"$f":"Archive4!X4","v":0},{"$f":"Archive4!Y4","v":0},{"$f":"Archive4!Z4","v":0},{"$f":"Archive4!AA4","v":0},{"$f":"Archive4!AB4","v":0},{"$f":"Archive4!AC4","v":0},{"$f":"Archive4!AD4","v":0},{"$f":"Archive4!AE4","v":0},{"$f":"Archive4!AF4","v":0},{"$f":"Archive4!AG4","v":0},{"$f":"Archive4!AH4","v":0},{"$f":"Archive4!AI4","v":0},{"$f":"Archive4!AJ4","v":0}]
[{"$f":"Archive4!O5","v":0},{"$f":"Archive4!P5","v":0},{"$f":"Archive4!Q5","v":0},{"$f":"Archive4!R5","v":0},{"$f":"Archive4!S5","v":0},{"$f":"Archive4!T5","v":0},{"$f":"Archive4!U5","v":0},{"$f":"Archive4!V5","v":0},{"$f":"Archive4!W5","v":0},{"$f":"Archive4!X5","v":0},{"$f":"Archive4!Y5","v":0},{"$f":"Archive4!Z5","v":0},{"$f":"Archive4!AA5","v":0},{"$f":"Archive4!AB5","v":0},{"$f":"Archive4!AC5","v":0},{"$f":"Archive4!AD5","v":0},{"$f":"Archive4!AE5","v":0},{"$f":"Archive4!AF5","v":0},{"$f":"Archive4!AG5","v":0},{"$f":"Archive4!AH5","v":0},{"$f":"Archive4!AI5","v":0},{"$f":"Archive4!AJ5","v":0}]
[{"$f":"Archive5!O4","v":0},{"$f":"Archive5!P4","v":0},{"$f":"Archive5!Q4","v":0},{"$f":"Archive5!R4","v":0},{"$f":"Archive5!S4","v":0},{"$f":"Archive5!T4","v":0},{"$f":"Archive5!U4","v":0},{"$f":"Archive5!V4","v":0},{"$f":"Archive5!W4","v":0},{"$f":"Archive5!X4","v":0},{"$f":"Archive5!Y4","v":0},{"$f":"Archive5!Z4","v":0},{"$f":"Archive5!AA4","v":0},{"$f":"Archive5!AB4","v":0},{"$f":"Archive5!AC4","v":0},{"$f":"Archive5!AD4","v":0},{"$f":"Archive5!AE4","v":0},{"$f":"Archive5!AF4","v":0},{"$f":"Archive5!AG4","v":0},{"$f":"Archive5!AH4","v":0},{"$f":"Archive5!AI4","v":0},{"$f":"Archive5!AJ4","v":0}]
[{"$f":"Archive5!O5","v":0},{"$f":"Archive5!P5","v":0},{"$f":"Archive5!Q5","v":0},{"$f":"Archive5!R5","v":0},{"$f":"Archive5!S5","v":0},{"$f":"Archive5!T5","v":0},{"$f":"Archive5!U5","v":0},{"$f":"Archive5!V5","v":0},{"$f":"Archive5!W5","v":0},{"$f":"Archive5!X5","v":0},{"$f":"Archive5!Y5","v":0},{"$f":"Archive5!Z5","v":0},{"$f":"Archive5!AA5","v":0},{"$f":"Archive5!AB5","v":0},{"$f":"Archive5!AC5","v":0},{"$f":"Archive5!AD5","v":0},{"$f":"Archive5!AE5","v":0},{"$f":"Archive5!AF5","v":0},{"$f":"Archive5!AG5","v":0},{"$f":"Archive5!AH5","v":0},{"$f":"Archive5!AI5","v":0},{"$f":"Archive5!AJ5","v":0}]

{"sheet":"recueil","index":12,"n_rows":101,"n_cols":43,"rows_kept":101,"cut":false,"hidden":false,"merged":[]}
["Diagnostic","moment","jour de naiss","mois","année","langue","finances","logement","état civil","parents","frères","sœurs"]
[1,null,{"$f":"DAY(Accueil!B13)","v":0},{"$f":"MONTH(Accueil!B13)","v":1},{"$f":"YEAR(Accueil!B13)","v":1900}]
[null,null,null,null,{"$f":"1939+E2","v":3839},null,null,null,null,null,{"$f":"IF($J$3=1,(L3-R12)*Accueil!$G$3*Accueil!$G$3/10,\"\")","v":""},140,"Silhouette perçue"]
[null,"père","mère","vous","sexe","date",null,null,null,null,{"$f":"IF($J$3=1,(L4-R12)*Accueil!$G$3*Accueil!$G$3/10,\"\")","v":""},140,"Silhouette idéale"]
[null,null,null,null,0,null,null,null,null,null,{"$f":"IF($J$3=1,(L5-R12)*Accueil!$G$3*Accueil!$G$3/10,\"\")","v":""},140,"Silhouette moyenne"]
[null,null,null,null,"  "]
["hospitalisations",null,"durée"]
[]
[null,null,null,null,null,null,null,null,null,null,null,null,null,null,null,null,null,null,null,null,"age"]
["thérapie I","type","durée","thérapie II","type","durée","thérapie III","type","durée",null,null,null,null,null,null,null,null,"coefficient",null,null,{"$f":"(TODAY()-Accueil!B13)/365","v":121.13150684931507}]
[null,null,null,null,null,null,null,null,null,null,null,null,null,null,null,null,null,"IMC",null,null,{"$f":"U10/10","v":12.113150684931508}]
[null,null,null,null,null,null,null,null,null,null,null,null,null,null,null,null,null,{"$f":"IF(U10<15,(S12/2.1*U11)*100,0)","v":0},{"$f":"COS(U11)","v":0.89904187856030604}]
["thérapie en cours",null,"type"]
[]
["Evaluation diag et impact BN",null,null,"Evaluation diag et impact AM",null,null,"Facteurs d'entretien",null,null,null,null,null,null,"BN",null,"AN"]
["Fréquence",null,{"$f":"IF(ISBLANK(B16),\"\",B16-1)","v":""},"seuil AM",null,{"$f":"IF(ISBLANK(E16),\"\",2-E16)","v":""},"Désir de maigrir","Q1",null,{"$f":"IF(ISBLANK(I16),\"\",I16-1)","v":""},{"$f":"IF(ISBLANK(I16),0,1)","v":0},null,null,{"$f":"IF(ISBLANK(B16),0,1)","v":0},null,{"$f":"IF(ISBLANK(E16),0,1)","v":0},null,null,null,null,null,null,null,null,null,null,null,null,null,null,null,null,null,null,null,null,null,null,null,null,null,null,{"$f":"IF(ISBLANK(AP16),\"\",AP16-1)","v":""}]
["Durée",null,"","contrôle pds",null,{"$f":"IF(ISBLANK(E17),\"\",2-E17)","v":""},null,"Q2",null,{"$f":"IF(ISBLANK(I17),\"\",I17-1)","v":""},{"$f":"IF(ISBLANK(I17),0,1)","v":0},null,null,{"$f":"IF(ISBLANK(B17),0,1)","v":0},null,{"$f":"IF(ISBLANK(E17),0,1)","v":0},null,null,null,null,null,null,null,null,null,null,null,null,null,null,null,null,null,null,null,null,null,null,null,null,null,null,{"$f":"IF(ISBLANK(AP17),\"\",AP17-1)","v":""}]
["vomissements",null,"","évitement prise pds",null,{"$f":"IF(ISBLANK(E18),\"\",2-E18)","v":""},null,"Q3",null,"",0,null,null,0,null,0,null,null,null,null,null,null,null,null,null,null,null,null,null,null,null,null,null,null,null,null,null,null,null,null,null,null,""]
["laxatifs",null,"","vomissements",null,{"$f":"IF(ISBLANK(E19),\"\",E19-1)","v":""},null,"Q4",null,"",0,null,null,0,null,0,null,null,null,null,null,null,null,null,null,null,null,null,null,null,null,null,null,null,null,null,null,null,null,null,null,null,""]
["diurétiques",null,"","laxatifs",null,"",null,"Q5",null,"",0,null,null,0,null,0,null,null,null,null,null,null,null,null,null,null,null,null,null,null,null,null,null,null,null,null,null,null,null,null,null,null,""]
["restrictions",null,"","diurétiques",null,"",null,"Q6",null,"",0,null,null,0,null,0,null,null,null,null,null,null,null,null,null,null,null,null,null,null,null,null,null,null,null,null,null,null,null,null,null,null,""]
["sélections",null,"","repas",null,"","Critiques envers le corps","Q7",null,"",0,null,null,0,null,0,null,null,null,null,null,null,null,null,null,null,null,null,null,null,null,null,null,null,null,null,null,null,null,null,null,null,""]
["sports",null,"","restrictions",null,"",null,"Q8",null,"",0,null,null,0,null,0,null,null,null,null,null,null,null,null,null,null,null,null,null,null,null,null,null,null,null,null,null,null,null,null,null,null,""]
["valeur perso",null,"","sport",null,"",null,"Q9",null,"",0,null,null,0,null,0,null,null,null,null,null,null,null,null,null,null,null,null,null,null,null,null,null,null,null,null,null,null,null,null,null,null,""]
["dents",null,"","phanères",null,"",null,"Q10",null,"",0,null,null,0,null,0,null,null,null,null,null,null,null,null,null,null,null,null,null,null,null,null,null,null,null,null,null,null,null,null,null,null,""]
["digestif",null,"","digestif",null,"",null,"Q11",null,"",0,null,null,0,null,0,null,null,null,null,null,null,null,null,null,null,null,null,null,null,null,null,null,null,null,null,null,null,null,null,null,null,""]
["physique",null,"","fatigue",null,"",null,"Q12",null,"",0,null,null,0,null,0,null,null,null,null,null,null,null,null,null,null,null,null,null,null,null,null,null,null,null,null,null,null,null,null,null,null,""]
["sexualité",null,"","sexualité",null,"","Restrictions","Q13",null,"",0,null,null,0,null,0,null,null,null,null,null,null,null,null,null,null,null,null,null,null,null,null,null,null,null,null,null,null,null,null,null,null,""]
["humeur",null,"","humeur",null,"",null,"Q14",null,"",0,null,null,0,null,0,null,null,null,null,null,null,null,null,null,null,null,null,null,null,null,null,null,null,null,null,null,null,null,null,null,null,""]
["anxiété",null,"","anxiété",null,"",null,"Q15",null,"",0,null,null,0,null,0,null,null,null,null,null,null,null,null,null,null,null,null,null,null,null,null,null,null,null,null,null,null,null,null,null,null,""]
["irritabilité",null,"","estime perso",null,"",null,"Q16",null,"",0,null,null,0,null,0,null,null,null,null,null,null,null,null,null,null,null,null,null,null,null,null,null,null,null,null,null,null,null,null,null,null,""]
["estime",null,"","irritabilité",null,"",null,"Q17",null,"",0,null,null,0,null,0,null,null,null,null,null,null,null,null,null,null,null,null,null,null,null,null,null,null,null,null,null,null,null,null,null,null,""]
["concentration",null,"","concentration",null,"",null,"Q18",null,"",0,null,null,0,null,0,null,null,null,null,null,null,null,null,null,null,null,null,null,null,null,null,null,null,null,null,null,null,null,null,null,null,""]
["sommeil",null,"","sommeil",null,"","Orthorexie","Q19",null,"",0,null,null,0,null,0,null,null,null,null,null,null,null,null,null,null,null,null,null,null,null,null,null,null,null,null,null,null,null,null,null,null,""]
["produits",null,"","produits",null,"",null,"Q20",null,"",0,null,null,0,null,0,null,null,null,null,null,null,null,null,null,null,null,null,null,null,null,null,null,null,null,null,null,null,null,null,null,null,""]
["travail",null,"","travail",null,"",null,"Q21",null,"",0,null,null,0,null,0,null,null,null,null,null,null,null,null,null,null,null,null,null,null,null,null,null,null,null,null,null,null,null,null,null,null,""]
["argent",null,"","activités",null,"",null,"Q22",null,"",0,null,null,0,null,0,null,null,null,null,null,null,null,null,null,null,null,null,null,null,null,null,null,null,null,null,null,null,null,null,null,null,""]
["famille",null,"","famille",null,"",null,"Q23",null,"",0,null,null,0,null,0,null,null,null,null,null,null,null,null,null,null,null,null,null,null,null,null,null,null,null,null,null,null,null,null,null,null,""]
["ami",null,"","amis",null,"",null,"Q24",null,"",0,null,null,0,null,0,null,null,null,null,null,null,null,null,null,null,null,null,null,null,null,null,null,null,null,null,null,null,null,null,null,null,""]
["amour",null,"","amour",null,"","Perfectionnisme","Q25",null,"",0,null,null,0,null,0,null,null,null,null,null,null,null,null,null,null,null,null,null,null,null,null,null,null,null,null,null,null,null,null,null,null,""]
["perso",null,{"$f":"IF(ISBLANK(B41),\"\",B41-1)","v":""},"souffrance",null,{"$f":"IF(ISBLANK(E41),\"\",E41-1)","v":""},null,"Q26",null,"",0,null,null,0,null,0,null,null,null,null,null,null,null,null,null,null,null,null,null,null,null,null,null,null,null,null,null,null,null,null,null,null,""]
[null,null,null,null,null,null,null,"Q27",null,"",0,null,null,{"$f":"SUM(N16:N41)","v":0},null,{"$f":"SUM(P16:P41)","v":0},null,null,null,null,null,null,null,null,null,null,null,null,null,null,null,null,null,null,null,null,null,null,null,null,null,null,""]
["Diagnostic",null,{"$f":"IF(ISBLANK(B16),\"\",(IF(C16*C17=0,\"TROUBLE ABSENT OU INFRA-CLINIQUE\",IF(C18+C19+C20+C23>2,\"BOULIMIE\",\"HYPERPHAGIE BOULIMIQUE\"))))","v":""},"Diagnostic",null,{"$f":"IF(ISBLANK(E16),\"\",(IF(F16*(F17+F18)=0,\"TROUBLE ABSENT OU INFRA-CLINIQUE\",IF(F19+F20+F21>1,\"ANOREXIE AVEC CONDUITES DE PURGES\",\"ANOREXIE RESTRICTIVE\"))))","v":""},null,"Q28",null,"",0,null,null,null,null,null,null,null,null,null,null,null,null,null,null,null,null,null,null,null,null,null,null,null,null,null,null,null,null,null,null,null,""]
["Incidence","physique",{"$f":"SUM(C25+C26+C27+C28+C34)/15","v":{"$error":"#VALUE!"}},"Incidence","physique",{"$f":"SUM(F25+F26+F27+F28+F34)/15","v":{"$error":"#VALUE!"}},null,"Q29",null,"",0,null,null,null,null,null,null,null,null,null,null,null,null,null,null,null,null,null,null,null,null,null,null,null,null,null,null,null,null,null,null,null,""]
[null,"psychique",{"$f":"SUM(C29+C30+C31+C32+C33+C35)/18","v":{"$error":"#VALUE!"}},null,"psychique",{"$f":"SUM(F29+F30+F31+F32+F33+F35)/18","v":{"$error":"#VALUE!"}},null,"Q30",null,"",0,null,null,null,null,null,null,null,null,null,null,null,null,null,null,null,null,null,null,null,null,null,null,null,null,null,null,null,null,null,null,null,""]
[null,"Sociale",{"$f":"SUM(C36:C40)/15","v":0},null,"sociale",{"$f":"SUM(F36:F40)/15","v":0},"Dépression","Q31",null,"",0,null,null,null,null,null,null,null,null,null,null,null,null,null,null,null,null,null,null,null,null,null,null,null,null,null,null,null,null,null,null,null,""]
[null,"Souffrance",{"$f":"C41/10","v":{"$error":"#VALUE!"}},null,"souffrance",{"$f":"F41/10","v":{"$error":"#VALUE!"}},null,"Q32",null,"",0,null,null,null,null,null,null,null,null,null,null,null,null,null,null,null,null,null,null,null,null,null,null,null,null,null,null,null,null,null,null,null,""]
[null,null,null,null,null,null,null,"Q33",null,"",0,null,null,null,null,null,null,null,null,null,null,null,null,null,null,null,null,null,null,null,null,null,null,null,null,null,null,null,null,null,null,null,""]
[null,null,null,null,null,null,null,"Q34",null,"",0,null,null,null,null,null,null,null,null,null,null,null,null,null,null,null,null,null,null,null,null,null,null,null,null,null,null,null,null,null,null,null,""]
[null,null,null,null,null,null,null,"Q35",null,"",0,null,null,null,null,null,null,null,null,null,null,null,null,null,null,null,null,null,null,null,null,null,null,null,null,null,null,null,null,null,null,null,""]
["Diagnostic",null,{"$f":"(C43&F43)","v":""},null,null,null,null,"Q36",null,"",0,null,null,null,null,null,null,null,null,null,null,null,null,null,null,null,null,null,null,null,null,null,null,null,null,null,null,null,null,null,null,null,""]
["Incidence","physique",{"$f":"IF(ISBLANK(A2),\"\",(IF(A2<4,F44,C44)))","v":{"$error":"#VALUE!"}},null,null,null,"Anxiété","Q37",null,"",0,null,null,null,null,null,null,null,null,null,null,null,null,null,null,null,null,null,null,null,null,null,null,null,null,null,null,null,null,null,null,null,""]
[null,"psychique",{"$f":"IF(ISBLANK(A2),\"\",(IF(A2<4,F45,C45)))","v":{"$error":"#VALUE!"}},null,null,null,null,"Q38",null,"",0,null,null,null,null,null,null,null,null,null,null,null,null,null,null,null,null,null,null,null,null,null,null,null,null,null,null,null,null,null,null,null,""]
[null,"sociale",{"$f":"IF(ISBLANK(A2),\"\",(IF(A2<4,F46,C46)))","v":0},null,null,null,null,"Q39",null,"",0,null,null,null,null,null,null,null,null,null,null,null,null,null,null,null,null,null,null,null,null,null,null,null,null,null,null,null,null,null,null,null,{"$f":"SUM(AQ16:AQ53)","v":0}]
[null,"Souffrance",{"$f":"IF(ISBLANK(A2),\"\",(IF(A2<4,F47,C47)))","v":{"$error":"#VALUE!"}},null,null,null,null,"Q40",null,"",0]
[null,null,null,null,null,null,null,"Q41",null,"",0]
[null,null,null,null,null,null,null,"Q42",null,"",0]
[null,null,null,null,null,null,"Impulsivité","Q43",null,"",0]
[null,null,null,null,null,null,null,"Q44",null,"",0]
[null,null,null,null,null,null,null,"Q45",null,"",0]
[null,null,null,null,null,null,null,"Q46",null,"",0]
[null,null,null,null,null,null,null,"Q47",null,"",0]
[null,null,null,null,null,null,null,"Q48",null,"",0]
[null,null,null,null,null,null,"Hypercontrôle","Q49",null,"",0]
[null,null,null,null,null,null,null,"Q50",null,"",0]
[null,null,null,null,null,null,null,"Q51",null,"",0]
[null,null,null,null,null,null,null,"Q52",null,"",0]
[null,null,null,null,null,null,null,"Q53",null,"",0]
[null,null,null,null,null,null,null,"Q54",null,"",0]
[null,null,null,null,null,null,"Manque d'affirmation de soi","Q55",null,"",0]
[null,null,null,null,null,null,null,"Q56",null,"",0]
[null,null,null,null,null,null,null,"Q57",null,"",0]
[null,null,null,null,null,null,null,"Q58",null,"",0]
[null,null,null,null,null,null,null,"Q59",null,"",0]
[null,null,null,null,null,null,null,"Q60",null,"",0]
[null,null,null,null,null,null,"Vie sociale et relationnelle","Q61",null,"",0]
[null,null,null,null,null,null,null,"Q62",null,"",0]
[null,null,null,null,null,null,null,"Q63",null,"",0]
[null,null,null,null,null,null,null,"Q64",null,"",0]
[null,null,null,null,null,null,null,"Q65",null,"",0]
[null,null,null,null,null,null,null,"Q66",null,{"$f":"IF(ISBLANK(I81),\"\",I81-1)","v":""},{"$f":"IF(ISBLANK(I81),0,1)","v":0}]
[null,null,null,null,null,null,"Faible estime de soi","Q67",null,"",0]
[null,null,null,null,null,null,null,"Q68",null,"",0]
[null,null,null,null,null,null,null,"Q69",null,"",0]
[null,null,null,null,null,null,null,"Q70",null,"",0]
[null,null,null,null,null,null,null,"Q71",null,"",0]
[null,null,null,null,null,null,null,"Q72",null,"",0]
[null,null,null,null,null,null,"Evitment de la maturité","Q73",null,"",0]
[null,null,null,null,null,null,null,"Q74",null,"",0]
[null,null,null,null,null,null,null,"Q75",null,"",0]
[null,null,null,null,null,null,null,"Q76",null,"",0]
[null,null,null,null,null,null,null,"Q77",null,"",0]
[null,null,null,null,null,null,null,"Q78",null,"",0]
[null,null,null,null,null,null,"Manque de motivation","Q79",null,"",0]
[null,null,null,null,null,null,null,"Q80",null,"",0]
[null,null,null,null,null,null,null,"Q81",null,"",0]
[null,null,null,null,null,null,null,"Q82",null,"",0]
[null,null,null,null,null,null,null,"Q83",null,{"$f":"IF(I101=TRUE,0,I98-2)","v":0},0]
[null,null,null,null,null,null,null,"Q84",null,{"$f":"IF(I100=TRUE,0,I99-2)","v":0},0]
[null,null,null,null,null,null,null,null,{"$f":"IF(I99<3,TRUE,FALSE)","v":true},null,{"$f":"SUM(K16:K99)","v":0}]
[null,null,null,null,null,null,null,null,{"$f":"IF(I98<3,TRUE,FALSE)","v":true}]

{"sheet":"Archive1","index":13,"n_rows":0,"n_cols":0,"rows_kept":0,"cut":false,"hidden":false,"merged":[]}

{"sheet":"Archive2","index":14,"n_rows":0,"n_cols":0,"rows_kept":0,"cut":false,"hidden":false,"merged":[]}

{"sheet":"Archive3","index":15,"n_rows":0,"n_cols":0,"rows_kept":0,"cut":false,"hidden":false,"merged":[]}

{"sheet":"Archive4","index":16,"n_rows":0,"n_cols":0,"rows_kept":0,"cut":false,"hidden":false,"merged":[]}

{"sheet":"Archive5","index":17,"n_rows":0,"n_cols":0,"rows_kept":0,"cut":false,"hidden":false,"merged":[]}

{"sheet":"listes","index":18,"n_rows":79,"n_cols":18,"rows_kept":79,"cut":false,"hidden":false,"merged":[]}
["Anorexie Mentale Restrictive (F50.0)",null,"NC",null,null,null,null,0,null,null,"Féminin",null,"Oui"]
["Anorexie Mentale avec purge (F50.0)",null,1,null,"Consultation préalable",null,null,1,"janvier",1940,"Masculin",null,"Mon poids est à ce seuil"]
["Anorexie atypique (F50.1)",null,2,null,"Entrée en hospitalisation",null,null,2,"février",1941,null,null,"Non",null,0,null,0]
["Boulimie avec purge (F50.2)",null,3,null,"Sortie d'hospitalisation",null,null,3,"mars",1942,{"$f":"L4/964*K5","v":107.46887966804979},1036,null,null,1,"Anorexie mentale restrictive IMC faible (6B80.00)",1]
["Boulimie sans purge (F50.2)",null,4,null,"Pré-test ambulatoire",null,null,4,"avril",1943,100,658,"Oui",null,2,"Anorexie mentale avec crises/purges IMC faible (6B80.01)",2]
["Hyperphagie Boulimique (F50.4)",null,"5 et +",null,"Bilan intermédiaire 1",null,null,5,"mai",1944,56,null,"Non",null,3,"Anorexie mentale restrictive IMC < 14,0 (6B80.10)",3]
["Boulimie atypique (F50.3)",null,null,null,"Bilan intermédiaire 2",null,null,6,"juin",1945,{"$f":"L5/530*K6","v":69.524528301886789},null,null,null,4,"Anorexie mentale avec crises/purges IMC < 14,0 (6B80.11)",4]
["TCA non spécifié (F50.9)",null,null,null,"Bilan intermédiaire 3",null,null,7,"juillet",1946,null,null,null,null,5,"Anorexie mentale en rémission IMC > 18,5 (6B80.2)",5]
[null,null,null,null,"Fin de traitement",null,null,8,"août",1947,null,null,null,null,6,"Anorexie mentale non spécifiée (6B80.Z)",6]
["Moins de 3 mois",null,null,null,"Post-test",null,null,9,"septembre",1948,null,null,null,null,7,"Boulimie (6B81)",7]
["De 3 à 6 mois","Français",null,"propre salaire","autre","célibataire",null,10,"octobre",1949,null,null,null,null,8,"Accès hyperphagiques (6B82)",8]
["De 6 mois à 2 ans","Allemand",null,"soutien des parents",null,"vie maritale",null,11,"novembre",1950,null,null,null,null,9,"Restriction/évitement de l'ingestion d'aliments (6B83)",9]
["Plus de 2 ans","Italien",null,"bourse",null,"marié(e)",null,12,"décembre",1951,null,null,null,null,10,"Pica (6B84)",10]
[null,"Anglais",null,"autre",null,"séparé(e) ou divorcé(e)",null,13,"janvier",1952,null,null,null,null,11,"Mérycisme (6B85)",11]
["Jamais","Espagnol",null,null,null,"veuf(ve)",null,14,"février",1953,null,null,null,null,12,"Syndrome d'alimentation nocturne (6B8Y)",12]
["Parfois (moins d'une fois sur deux)","Arabe",null,null,null,null,null,15,"mars",1954,null,null,null,null,13,"Trouble purgatif (6B8Y)",13]
["Souvent (plus d'une fois sur deux)","Autre",null,null,null,null,null,16,"avril",1955,null,null,null,null,14,"Autre TCA non spécifié (6B8Z)"]
["A chaque crise",null,null,null,null,null,null,17,"mai",1956,null,1,"-"]
["A chaque crise et à certains repas",null,null,null,null,null,null,18,"juin",1957,null,2,"Maigreur"]
[null,"seul(e)",null,"mariés",null,"aucun",null,19,"juillet",1958,null,3,"Rondeurs",null,null,"Normes","grossir",{"$f":"4.38/30","v":0.14599999999999999}]
["Jamais","avec vos parents",null,"séparés ou divorcés",null,"CAP",null,20,"août",1959,null,4,"Surpoids"]
["Parfois","en couple",null,"vie maritale",null,"BEPC",null,21,"septembre",1960,null,5,"Boulimie"]
["Souvent","en collocation",null,"père décédé",null,"1ère",null,22,"octobre",1961,null,6,"Anorexie"]
["Quotidiennement","en foyer",null,"mère décédée",null,"2nde",null,23,"novembre",1962]
[null,"sans domicile",null,"tous deux décédés",null,"BAC",null,24,"décembre",1963]
["Je prends 3 repas et 1 collation chaque jour",null,null,"père inconnu",null,"BAC + 1",null,25,null,1964,null,"Tout à fait d'accord"]
["Je saute un de ces repas régulièrement","Agriculteurs exploitants",null,"mère inconnue",null,"BAC + 2",null,26,null,1965,null,"Plutôt d'accord"]
["Je saute deux de ces repas régulièrement","Artisans, commerçants et chefs d'entreprise",null,"tous deux inconnus",null,"BAC + 3",null,27,null,1966,null,"Plutôt en désaccord"]
["Je saute trois de ces repas régulièrement","Cadres et professions intellectuelles supérieures",null,null,null,"BAC + 4",null,28,null,1967,null,"Tout à fait en désaccord"]
["Je mange indifféremment de tout","Professions Intermédiaires",null,null,null,"BAC + 5",null,29,null,1968]
["J'évite les graisses","Employés",null,"psychothérapie classique",null,"BAC + 6","en individuel",30,null,1969,null,"Non concerné(e) "]
["J'évite les sucres et les féculents","Ouvriers",null,"psychanalyse",null,"> BAC + 6","en groupe",31,null,1970,null,"Ne me correspond pas du tout"]
["J'évite les graisses et les sucres","Etudiants",null,"thérapie rogérienne",null,null,"autre",null,null,1971,null,"Me correspond un peu"]
["J'évite tous les aliments riches","Retraités",null,"gestalt",null,null,null,null,null,1972,null,"Me correspond moyennement"]
[null,"Autres personnes sans activité professionnelle",null,"thérapie de famille",null,null,null,null,null,1973,null,"Me correspond beaucoup"]
["Non, pas particulièrement",null,null,"TCC",null,null,null,null,null,1974,null,"Me correspond tout à fait"]
["Oui, un peu",null,null,"relaxation",null,null,null,null,null,1975]
["Oui, considérablement",null,null,"hypnose",null,null,null,null,null,1976]
["Totalement",null,null,"TIP",null,null,null,null,null,1977]
[null,null,null,"autre",null,null,null,null,null,1978]
["Nul",null,null,null,null,null,null,null,null,1979]
["Modeste",null,null,null,null,null,null,null,null,1980]
["Important","Moins de 1 par semaine",null,null,"Toujours",null,"Absolument faux",null,null,1981]
["Considérable","De 1 à 3 par semaine",null,null,"En général",null,"A été vrai dans le passé",null,null,1982]
["Non concerné","De 4 à 6 par semaine",null,null,"Souvent",null,"Vrai de temps en temps",null,null,1983]
[null,"De 1 à 2 par jour",null,null,"Quelquefois",null,"Moyennement vrai",null,null,1984]
[null,"Plus de 2 par jour",null,null,"Rarement",null,"Généralement vrai",null,null,1985]
[null,null,null,null,"Jamais",null,"Parfaitement vrai",null,null,1986]
[null,null,null,null,null,null,null,null,null,1987]
[null,null,null,null,null,null,null,null,null,1988]
["Jamais",null,null,null,null,null,null,null,null,1989]
["Rarement (moins d'une fois par semaine)",null,null,"Vrai maintenant et quand j'étais jeune",null,null,null,null,null,1990]
["Parfois (une à deux fois par semaine)",null,null,"Vrai seulement maintenant",null,null,null,null,null,1991]
["Souvent (au moins deux fois par semaine)",null,null,"Vrai seulement avant mes 16 ans",null,null,null,null,null,1992]
["Quotidiennement (une fois par jour ou plus)",null,null,"Jamais vrai",null,null,null,null,null,1993]
[null,null,null,null,null,null,null,null,null,1994]
["Non, pas particulièrement",null,null,null,null,null,null,null,null,1995]
["Parfois (moins d'une heure par semaine)",null,null,null,null,null,null,null,null,1996]
["Souvent (1 à 6 heures par semaine)",null,null,null,null,null,null,null,null,1997]
["Quotidiennement (une heure par jour)",null,null,null,null,null,null,null,null,1998]
["Fréquemment (plus d'une heure par jour)",null,null,null,null,null,null,null,null,1999]
[null,null,null,null,null,null,null,null,null,2000]
[]
["Nul (ou ne me concerne pas)"]
["Modeste (moins d'intérêt pour la sexualité)"]
["Important (peu d'intérêt pour la sexualité)"]
["Considérable (aucun intérêt pour la sexualité)"]
["Non concerné"]
[]
[]
["Inventaire d'anxiété"]
["Non"]
["Plutôt non"]
["Plutôt oui"]
["Oui"]
["Non"]
[]
["Plutôt vrai"]
["Plutôt faux"]

{"sheet":"IMC d'équilibre","index":19,"n_rows":260,"n_cols":14,"rows_kept":260,"cut":false,"hidden":false,"merged":[]}
["CODE",{"$f":"'Courbe In'!A2","v":" "},null,null,null,"Age en mois","Mini Normal","IMC anorexie","IMC dangereux","Max normal","Hospit","IMC d'équilibre","IMC de sortie","IMC dangereux"]
["Prénom",{"$f":"'Courbe In'!A4","v":0},null,null,null,12,{"$f":"'Courbe IMC'!C51","v":16.071999999999999},{"$f":"G2*17/18.5","v":14.768864864864865},{"$f":"G2*15/18.5","v":13.031351351351351},{"$f":"'Courbe IMC'!C$48","v":18.911500000000004},{"$f":"G2*16/18.5","v":13.900108108108107},{"$f":"'Courbe IMC'!C5","v":16.399999999999999},{"$f":"L2*16/19","v":13.810526315789472},{"$f":"L2*14.5/19","v":12.51578947368421}]
[null,null,null,null,null,13,{"$f":"G2-((G$2-G$14)/12)","v":16.003166666666665},{"$f":"G3*17/18.5","v":14.705612612612612},{"$f":"G3*15/18.5","v":12.975540540540539},{"$f":"J2-((J2-J14)/12)","v":18.810916666666671},{"$f":"G3*16/18.5","v":13.840576576576575},{"$f":"(L2-L14)/12+L14","v":15.8005},{"$f":"(M2-M14)/12+M14","v":13.305684210526316},{"$f":"(N2-N14)/12+N14","v":12.058276315789474}]
[null,"Années","mois","Age en mois","Age exact",14,{"$f":"G3-(($G$2-$G$14)/12)","v":15.934333333333331},14.642360360360357,12.919729729729728,{"$f":"J3-((J$2-J$14)/12)","v":18.710333333333338},13.781045045045044,{"$f":"(L2-L14)*2/12+L14","v":15.855},{"$f":"(M2-M14)*2/12+M14","v":13.351578947368422},{"$f":"(N2-N14)*2/12+N14","v":12.099868421052632}]
["Age",{"$f":"TRUNC(D5/12)","v":121},{"$f":"D5-B5*12","v":1.8967444919435366},{"$f":"TRUNC(Accueil!B3-'Courbe In'!A6)/30.41","v":1453.8967444919435},{"$f":"('Courbe In'!D3-'Courbe In'!A6)/30.41","v":1453.8967444919435},15,15.865499999999997,14.579108108108105,12.863918918918916,18.609750000000005,13.721513513513511,{"$f":"(L2-L14)*3/12+L14","v":15.9095},{"$f":"(M2-M14)*3/12+M14","v":13.397473684210526},{"$f":"(N2-N14)*3/12+N14","v":12.14146052631579}]
["Sexe","F","M",null,null,16,15.796666666666663,14.515855855855854,12.808108108108106,18.509166666666673,13.661981981981979,{"$f":"(L2-L14)*4/12+L14","v":15.964},{"$f":"(M2-M14)*4/12+M14","v":13.443368421052632},{"$f":"(N2-N14)*4/12+N14","v":12.183052631578947}]
["IMC d'équilibre",{"$f":"D12/B8*B8","v":{"$error":"#VALUE!"}},{"$f":"(VLOOKUP(D5,F:N,6)+(VLOOKUP(D5+1,F:N,6)-VLOOKUP(D5,F:N,6))*(E5-D5))*B41+(L254+(E5-264)*5.8/(12*58))*B42*B43+(L254+5.8)*B44","v":24.8},null,null,17,15.727833333333329,14.452603603603599,12.752297297297293,18.40858333333334,13.602450450450448,{"$f":"(L2-L14)*5/12+L17","v":15.858899999999998},{"$f":"(M2-M14)*5/12+M17","v":13.354863157894735},{"$f":"(N2-N14)*5/12+N14","v":12.224644736842105}]
["Taille en mètres",{"$f":"'Courbe In'!B7","v":""},{"$f":"'Courbe In'!B7","v":""},null,null,18,15.658999999999995,14.389351351351348,12.696486486486483,18.308000000000007,13.542918918918915,{"$f":"(L2-L14)*6/12+L14","v":16.073},{"$f":"(M2-M14)*6/12+M14","v":13.535157894736841},{"$f":"(N2-N14)*6/12+N14","v":12.266236842105263}]
[null,null,null,null,null,19,15.590166666666661,14.326099099099094,12.64067567567567,18.207416666666674,13.483387387387383,{"$f":"(L2-L14)*7/12+L14","v":16.127499999999998},{"$f":"(M2-M14)*7/12+M14","v":13.581052631578947},{"$f":"(N2-N14)*7/12+N14","v":12.307828947368421}]
["Poids dangereux",{"$f":"((VLOOKUP(D5,F:I,4)+(VLOOKUP(D5+1,F:I,4)-VLOOKUP(D5,F:I,4))*(E5-D5))*B41+(19+(E5-264)*2/(12*58))*14.5/19*B42*B43+24.8*B44*14.5/19)*B8*B8","v":{"$error":"#VALUE!"}},{"$f":"((VLOOKUP(D5,F:N,8)+(VLOOKUP(D5+1,F:N,8)-VLOOKUP(D5,F:N,8))*(E5-D5))*B41+(L254+(E5-264)*2/(12*58))*14.5/19*B42*B43+(L254+5.8)*B44*14.5/19)*C8*C8","v":{"$error":"#VALUE!"}},{"$f":"(VLOOKUP(INT(D5),F:I,4))*B8*B8","v":{"$error":"#VALUE!"}},null,20,15.521333333333327,14.262846846846839,12.58486486486486,18.106833333333341,13.423855855855852,{"$f":"(L2-L14)*8/12+L14","v":16.181999999999999},{"$f":"(M2-M14)*8/12+M14","v":13.626947368421051},{"$f":"(N2-N14)*8/12+N14","v":12.349421052631579}]
["Poids de sortie",{"$f":"((VLOOKUP(D5,F:I,3)+(VLOOKUP(D5+1,F:I,3)-VLOOKUP(D5,F:I,3))*(E5-D5))*B41+(19+(E5-264)*2/(12*58))*16/19*B42*B43+24.8*B44*16/19)*B8*B8","v":{"$error":"#VALUE!"}},{"$f":"((VLOOKUP(D5,F:N,7)+(VLOOKUP(D5+1,F:N,7)-VLOOKUP(D5,F:N,7))*(E5-D5))*B41+(L254+(E5-264)*2/(12*58))*16/19*B42*B43+(L254+5.8)*B44*16/19)*C8*C8","v":{"$error":"#VALUE!"}},{"$f":"VLOOKUP(INT(D5),F:I,3)*B8*B8","v":{"$error":"#VALUE!"}},null,21,15.452499999999993,14.199594594594588,12.529054054054049,18.006250000000009,13.364324324324318,{"$f":"(L2-L14)*9/12+L14","v":16.236499999999999},{"$f":"(M2-M14)*9/12+M14","v":13.672842105263157},{"$f":"(N2-N14)*9/12+N14","v":12.391013157894736}]
["Poids d'équilibre",{"$f":"((VLOOKUP(D5,F:I,2)+(VLOOKUP(D5+1,F:I,2)-VLOOKUP(D5,F:I,2))*(E5-D5))*B41+(G254+(E5-264)*2/(12*58))*B42*B43+(G254+5.8)*B44)*B8*B8","v":{"$error":"#VALUE!"}},{"$f":"((VLOOKUP(D5,F:N,6)+(VLOOKUP(D5+1,F:N,6)-VLOOKUP(D5,F:N,6))*(E5-D5))*B41+(L254+(E5-264)*2/(12*58))*B42*B43+(L254+5.8)*B44)*C8*C8","v":{"$error":"#VALUE!"}},{"$f":"(VLOOKUP(INT($D$5),$F:$J,2)*$B$8*$B$8)","v":{"$error":"#VALUE!"}},{"$f":"(VLOOKUP(INT($D$5),$F:$J,5)*$B$8*$B$8)","v":{"$error":"#VALUE!"}},22,15.383666666666659,14.136342342342337,12.473243243243237,17.905666666666676,13.304792792792787,{"$f":"(L2-L14)*10/12+L14","v":16.291},{"$f":"(M2-M14)*10/12+M14","v":13.718736842105262},{"$f":"(N2-N14)*10/12+N14","v":12.432605263157894}]
[null,null,null,null,null,23,15.314833333333326,14.073090090090085,12.417432432432426,17.805083333333343,13.245261261261254,{"$f":"(L2-L14)*11/12+L14","v":16.345499999999998},{"$f":"(M2-M14)*11/12+M14","v":13.764631578947368},{"$f":"(N2-N14)*11/12+N14","v":12.474197368421052}]
["Date",{"$f":"NOW()","v":"2021-01-17T16:05:21.520"},null,null,2,24,{"$f":"'Courbe IMC'!D51","v":15.246},14.009837837837839,12.361621621621621,{"$f":"'Courbe IMC'!D$48","v":17.704499999999999},13.185729729729729,{"$f":"G14+0.5","v":15.746},{"$f":"L14*16/19","v":13.259789473684211},{"$f":"L14*14.5/19","v":12.016684210526316}]
[null,null,null,null,null,25,{"$f":"G14-(($G$14-$G$26)/12)","v":15.1928},13.960951351351351,12.318486486486487,{"$f":"J14-((J$14-J$26)/12)","v":17.673458333333333},13.13971891891892,{"$f":"L14-(L14-L26)/12","v":15.6928},{"$f":"M14-(M14-M26)/12","v":13.214989473684211},{"$f":"N14-(N14-N26)/12","v":11.976084210526317}]
["au bout d'un mois",null,null,null,null,26,{"$f":"G15-(($G$14-$G$26)/12)","v":15.1396},13.912064864864865,12.27535135135135,{"$f":"J15-((J$14-J$26)/12)","v":17.642416666666666},13.093708108108109,{"$f":"L15-(L14-L26)/12","v":15.6396},{"$f":"M15-(M14-M26)/12","v":13.170189473684211},{"$f":"N15-(N14-N26)/12","v":11.935484210526317}]
["Poids dangereux",{"$f":"((VLOOKUP(D5+1,F:I,4)+(VLOOKUP(D5+2,F:I,4)-VLOOKUP(D5+1,F:I,4))*(E5-D5))*B41+(19+(E5-264)*2/(12*58))*14.5/19*B42*B43+24.8*B44*14.5/19)*B8*B8","v":{"$error":"#VALUE!"}},{"$f":"((VLOOKUP(D5+1,F:N,8)+(VLOOKUP(D5+2,F:N,8)-VLOOKUP(D5+1,F:N,8))*(E5-D5))*B41+(L254+(E5-264)*2/(12*58))*14.5/19*B42*B43+(L254+5.8)*B44*14.5/19)*C8*C8","v":{"$error":"#VALUE!"}},null,null,27,15.086399999999999,13.863178378378377,12.232216216216216,17.611374999999999,13.047697297297297,{"$f":"L16-(L14-L26)/12","v":15.586399999999999},{"$f":"M16-(M14-M26)/12","v":13.12538947368421},{"$f":"N16-(N14-N26)/12","v":11.894884210526318}]
["Poids de sortie",{"$f":"((VLOOKUP(D5+1,F:I,3)+(VLOOKUP(D5+2,F:I,3)-VLOOKUP(D5+1,F:I,3))*(E5-D5))*B41+(19+(E5-264)*2/(12*58))*16/19*B42*B43+24.8*B44*16/19)*B8*B8","v":{"$error":"#VALUE!"}},{"$f":"((VLOOKUP(D5+1,F:N,7)+(VLOOKUP(D5+2,F:N,7)-VLOOKUP(D5+1,F:N,7))*(E5-D5))*B41+(L254+(E5-264)*2/(12*58))*16/19*B42*B43+(L254+5.8)*B44*16/19)*C8*C8","v":{"$error":"#VALUE!"}},null,null,28,15.033199999999999,13.814291891891891,12.189081081081081,17.580333333333332,13.001686486486486,{"$f":"L17-(L14-L26)/12","v":15.533199999999999},{"$f":"M17-(M14-M26)/12","v":13.08058947368421},{"$f":"N17-(N14-N26)/12","v":11.854284210526318}]
["Poids d'équilibre",{"$f":"((VLOOKUP(D5+1,F:I,2)+(VLOOKUP(D5+2,F:I,2)-VLOOKUP(D5+1,F:I,2))*(E5-D5))*B41+(G254+(E5-264)*2/(12*58))*B42*B43+(G254+5.8)*B44)*B8*B8","v":{"$error":"#VALUE!"}},{"$f":"((VLOOKUP(D5+1,F:N,6)+(VLOOKUP(D5+2,F:N,6)-VLOOKUP(D5+1,F:N,6))*(E5-D5))*B41+(L254+(E5-264)*2/(12*58))*B42*B43+(L254+5.8)*B44)*C8*C8","v":{"$error":"#VALUE!"}},null,null,29,14.979999999999999,13.765405405405403,12.145945945945945,17.549291666666665,12.955675675675675,{"$f":"L18-(L14-L26)/12","v":15.479999999999999},{"$f":"M18-(M14-M26)/12","v":13.035789473684209},{"$f":"N18-(N14-N26)/12","v":11.813684210526318}]
[null,null,null,null,null,30,14.926799999999998,13.716518918918917,12.10281081081081,17.518249999999998,12.909664864864864,{"$f":"L19-(L14-L26)/12","v":15.426799999999998},{"$f":"M19-(M14-M26)/12","v":12.990989473684209},{"$f":"N19-(N14-N26)/12","v":11.773084210526319}]
["au bout de deux mois",null,null,null,null,31,14.873599999999998,13.667632432432431,12.059675675675674,17.487208333333331,12.863654054054052,{"$f":"L20-(L14-L26)/12","v":15.373599999999998},{"$f":"M20-(M14-M26)/12","v":12.946189473684209},{"$f":"N20-(N14-N26)/12","v":11.732484210526319}]
["Poids dangereux",{"$f":"((VLOOKUP(D5+2,F:I,4)+(VLOOKUP(D5+3,F:I,4)-VLOOKUP(D5+2,F:I,4))*(E5-D5))*B41+(19+(E5-264)*2/(12*58))*14.5/19*B42*B43+24.8*B44*14.5/19)*B8*B8","v":{"$error":"#VALUE!"}},{"$f":"((VLOOKUP(D5+2,F:N,8)+(VLOOKUP(D5+3,F:N,8)-VLOOKUP(D5+2,F:N,8))*(E5-D5))*B41+(L254+(E5-264)*2/(12*58))*14.5/19*B42*B43+(L254+5.8)*B44*14.5/19)*C8*C8","v":{"$error":"#VALUE!"}},null,null,32,14.820399999999998,13.618745945945944,12.016540540540538,17.456166666666665,12.817643243243241,{"$f":"L21-(L14-L26)/12","v":15.320399999999998},{"$f":"M21-(M14-M26)/12","v":12.901389473684208},{"$f":"N21-(N14-N26)/12","v":11.69188421052632}]
["Poids de sortie",{"$f":"((VLOOKUP(D5+2,F:I,3)+(VLOOKUP(D5+3,F:I,3)-VLOOKUP(D5+2,F:I,3))*(E5-D5))*B41+(19+(E5-264)*2/(12*58))*16/19*B42*B43+24.8*B44*16/19)*B8*B8","v":{"$error":"#VALUE!"}},{"$f":"((VLOOKUP(D5+2,F:N,7)+(VLOOKUP(D5+3,F:N,7)-VLOOKUP(D5+2,F:N,7))*(E5-D5))*B41+(L254+(E5-264)*2/(12*58))*16/19*B42*B43+(L254+5.8)*B44*16/19)*C8*C8","v":{"$error":"#VALUE!"}},null,null,33,14.767199999999997,13.569859459459456,11.973405405405403,17.425124999999998,12.77163243243243,{"$f":"L22-(L14-L26)/12","v":15.267199999999997},{"$f":"M22-(M14-M26)/12","v":12.856589473684208},{"$f":"N22-(N14-N26)/12","v":11.65128421052632}]
["Poids d'équilibre",{"$f":"((VLOOKUP(D5+2,F:I,2)+(VLOOKUP(D5+3,F:I,2)-VLOOKUP(D5+2,F:I,2))*(E5-D5))*B41+(G254+(E5-264)*2/(12*58))*B42*B43+(G254+5.8)*B44)*B8*B8","v":{"$error":"#VALUE!"}},{"$f":"((VLOOKUP(D5+2,F:N,6)+(VLOOKUP(D5+3,F:N,6)-VLOOKUP(D5+2,F:N,6))*(E5-D5))*B41+(L254+(E5-264)*2/(12*58))*B42*B43+(L254+5.8)*B44)*C8*C8","v":{"$error":"#VALUE!"}},null,null,34,14.713999999999997,13.52097297297297,11.930270270270267,17.394083333333331,12.725621621621618,{"$f":"L23-(L14-L26)/12","v":15.213999999999997},{"$f":"M23-(M14-M26)/12","v":12.811789473684208},{"$f":"N23-(N14-N26)/12","v":11.610684210526321}]
[null,null,null,null,null,35,14.660799999999997,13.472086486486484,11.887135135135132,17.363041666666664,12.679610810810807,{"$f":"L24-(L14-L26)/12","v":15.160799999999997},{"$f":"M24-(M14-M26)/12","v":12.766989473684207},{"$f":"N24-(N14-N26)/12","v":11.570084210526321}]
["au bout de trois mois",null,null,null,3,36,{"$f":"'Courbe IMC'!E$51","v":14.6076},13.4232,11.843999999999999,{"$f":"'Courbe IMC'!E$48","v":17.332000000000001},12.633599999999999,{"$f":"G26+0.5","v":15.1076},{"$f":"L26*16/19","v":12.72218947368421},{"$f":"L26*14.5/19","v":11.529484210526316}]
["Poids dangereux",{"$f":"((VLOOKUP(D5+3,F:I,4)+(VLOOKUP(D5+4,F:I,4)-VLOOKUP(D5+3,F:I,4))*(E5-D5))*B41+(19.025+(E5-264)*2/(12*58))*14.5/19*B42*B43+24.825*B44*14.5/19)*B8*B8","v":{"$error":"#VALUE!"}},{"$f":"((VLOOKUP(D5+3,F:N,8)+(VLOOKUP(D5+4,F:N,8)-VLOOKUP(D5+3,F:N,8))*(E5-D5))*B41+(L254+0.025+(E5-264)*2/(12*58))*14.5/19*B42*B43+(L254+5.825)*B44*14.5/19)*C8*C8","v":{"$error":"#VALUE!"}},null,null,37,{"$f":"G26-((G$26-G$38)/12)","v":14.582924999999999},13.400525675675675,11.823993243243244,{"$f":"J26-((J$26-J$38)/12)","v":17.309058333333333},12.612259459459459,{"$f":"L26-(L26-L38)/12","v":15.082924999999999},{"$f":"M26-(M26-M38)/12","v":12.70141052631579},{"$f":"N26-(N26-N38)/12","v":11.510653289473685}]
["Poids de sortie",{"$f":"((VLOOKUP(D5+3,F:I,3)+(VLOOKUP(D5+4,F:I,3)-VLOOKUP(D5+3,F:I,3))*(E5-D5))*B41+(19.025+(E5-264)*2/(12*58))*16/19*B42*B43+24.825*B44*16/19)*B8*B8","v":{"$error":"#VALUE!"}},{"$f":"((VLOOKUP(D5+3,F:N,7)+(VLOOKUP(D5+4,F:N,7)-VLOOKUP(D5+3,F:N,7))*(E5-D5))*B41+(L254+0.025+(E5-264)*2/(12*58))*16/19*B42*B43+(L254+5.825)*B44*16/19)*C8*C8","v":{"$error":"#VALUE!"}},null,null,38,{"$f":"G27-((G$26-G$38)/12)","v":14.558249999999999},13.37785135135135,11.803986486486487,{"$f":"J27-((J$26-J$38)/12)","v":17.286116666666665},12.590918918918918,{"$f":"L27-(L26-L38)/12","v":15.058249999999999},{"$f":"M27-(M26-M38)/12","v":12.68063157894737},{"$f":"N27-(N26-N38)/12","v":11.491822368421055}]
["Poids d'équilibre",{"$f":"((VLOOKUP(D5+3,F:I,2)+(VLOOKUP(D5+4,F:I,2)-VLOOKUP(D5+3,F:I,2))*(E5-D5))*B41+(G254+0.025+(E5-264)*2/(12*58))*B42*B43+(G254+5.825)*B44)*B8*B8","v":{"$error":"#VALUE!"}},{"$f":"((VLOOKUP(D5+3,F:N,6)+(VLOOKUP(D5+4,F:N,6)-VLOOKUP(D5+3,F:N,6))*(E5-D5))*B41+(L254+0.025+(E5-264)*2/(12*58))*B42*B43+(L254+5.825)*B44)*C8*C8","v":{"$error":"#VALUE!"}},null,null,39,14.533574999999999,13.355177027027025,11.78397972972973,17.263174999999997,12.569578378378377,{"$f":"L28-(L26-L38)/12","v":15.033574999999999},{"$f":"M28-(M26-M38)/12","v":12.65985263157895},{"$f":"N28-(N26-N38)/12","v":11.472991447368424}]
[null,null,null,null,null,40,14.508899999999999,13.332502702702703,11.763972972972971,17.240233333333329,12.548237837837837,{"$f":"L29-(L26-L38)/12","v":15.008899999999999},{"$f":"M29-(M26-M38)/12","v":12.63907368421053},{"$f":"N29-(N26-N38)/12","v":11.454160526315793}]
["au bout de quatre mois",null,null,null,null,41,14.484224999999999,13.309828378378377,11.743966216216215,17.217291666666661,12.526897297297296,{"$f":"L30-(L26-L38)/12","v":14.984224999999999},{"$f":"M30-(M26-M38)/12","v":12.61829473684211},{"$f":"N30-(N26-N38)/12","v":11.435329605263162}]
["Poids dangereux",{"$f":"((VLOOKUP(D5+4,F:I,4)+(VLOOKUP(D5+5,F:I,4)-VLOOKUP(D5+4,F:I,4))*(E5-D5))*B41+(19.025+(E5-264)*2/(12*58))*14.5/19*B42*B43+24.825*B44*14.5/19)*B8*B8","v":{"$error":"#VALUE!"}},{"$f":"((VLOOKUP(D5+4,F:N,8)+(VLOOKUP(D5+5,F:N,8)-VLOOKUP(D5+4,F:N,8))*(E5-D5))*B41+(L254+0.025+(E5-264)*2/(12*58))*14.5/19*B42*B43+(L254+5.825)*B44*14.5/19)*C8*C8","v":{"$error":"#VALUE!"}},null,null,42,14.459549999999998,13.287154054054053,11.723959459459458,17.194349999999993,12.505556756756755,{"$f":"L31-(L26-L38)/12","v":14.959549999999998},{"$f":"M31-(M26-M38)/12","v":12.59751578947369},{"$f":"N31-(N26-N38)/12","v":11.416498684210531}]
["Poids de sortie",{"$f":"((VLOOKUP(D5+4,F:I,3)+(VLOOKUP(D5+5,F:I,3)-VLOOKUP(D5+4,F:I,3))*(E5-D5))*B41+(19.025+(E5-264)*2/(12*58))*16/19*B42*B43+24.825*B44*16/19)*B8*B8","v":{"$error":"#VALUE!"}},{"$f":"((VLOOKUP(D5+4,F:N,7)+(VLOOKUP(D5+5,F:N,7)-VLOOKUP(D5+4,F:N,7))*(E5-D5))*B41+(L254+0.025+(E5-264)*2/(12*58))*16/19*B42*B43+(L254+5.825)*B44*16/19)*C8*C8","v":{"$error":"#VALUE!"}},null,null,43,14.434874999999998,13.264479729729729,11.703952702702701,17.171408333333325,12.484216216216215,{"$f":"L32-(L26-L38)/12","v":14.934874999999998},{"$f":"M32-(M26-M38)/12","v":12.576736842105269},{"$f":"N32-(N26-N38)/12","v":11.3976677631579}]
["Poids d'équilibre",{"$f":"((VLOOKUP(D5+4,F:I,2)+(VLOOKUP(D5+5,F:I,2)-VLOOKUP(D5+4,F:I,2))*(E5-D5))*B41+(G254+0.025+(E5-264)*2/(12*58))*B42*B43+(G254+5.825)*B44)*B8*B8","v":{"$error":"#VALUE!"}},{"$f":"((VLOOKUP(D5+4,F:N,6)+(VLOOKUP(D5+5,F:N,6)-VLOOKUP(D5+4,F:N,6))*(E5-D5))*B41+(L254+0.025+(E5-264)*2/(12*58))*B42*B43+(L254+5.825)*B44)*C8*C8","v":{"$error":"#VALUE!"}},null,null,44,14.410199999999998,13.241805405405405,11.683945945945943,17.148466666666657,12.462875675675674,{"$f":"L33-(L26-L38)/12","v":14.910199999999998},{"$f":"M33-(M26-M38)/12","v":12.555957894736849},{"$f":"N33-(N26-N38)/12","v":11.378836842105269}]
[null,null,null,null,null,45,14.385524999999998,13.219131081081079,11.663939189189188,17.125524999999989,12.441535135135133,{"$f":"L34-(L26-L38)/12","v":14.885524999999998},{"$f":"M34-(M26-M38)/12","v":12.535178947368429},{"$f":"N34-(N26-N38)/12","v":11.360005921052638}]
["au bout de cinq mois",null,null,null,null,46,14.360849999999997,13.196456756756755,11.643932432432431,17.102583333333321,12.420194594594593,{"$f":"L35-(L26-L38)/12","v":14.860849999999997},{"$f":"M35-(M26-M38)/12","v":12.514400000000009},{"$f":"N35-(N26-N38)/12","v":11.341175000000007}]
["Poids dangereux",{"$f":"((VLOOKUP(D5+5,F:I,4)+(VLOOKUP(D5+6,F:I,4)-VLOOKUP(D5+5,F:I,4))*(E5-D5))*B41+(19.025+(D5-264)*2/(12*58))*14.5/19*B42*B43+24.825*B44*14.5/19)*B8*B8","v":{"$error":"#VALUE!"}},{"$f":"((VLOOKUP(D5+5,F:N,8)+(VLOOKUP(D5+6,F:N,8)-VLOOKUP(D5+5,F:N,8))*(E5-D5))*B41+(L254+0.025+(E5-264)*2/(12*58))*14.5/19*B42*B43+(L254+5.825)*B44*14.5/19)*C8*C8","v":{"$error":"#VALUE!"}},null,null,47,14.336174999999997,13.17378243243243,11.623925675675673,17.079641666666653,12.398854054054052,{"$f":"L36-(L26-L38)/12","v":14.836174999999997},{"$f":"M36-(M26-M38)/12","v":12.493621052631589},{"$f":"N36-(N26-N38)/12","v":11.322344078947376}]
["Poids de sortie",{"$f":"((VLOOKUP(D5+5,F:I,3)+(VLOOKUP(D5+6,F:I,3)-VLOOKUP(D5+5,F:I,3))*(E5-D5))*B41+(19.025+(E5-264)*2/(12*58))*16/19*B42*B43+24.825*B44*16/19)*B8*B8","v":{"$error":"#VALUE!"}},{"$f":"((VLOOKUP(D5+5,F:N,7)+(VLOOKUP(D5+6,F:N,7)-VLOOKUP(D5+5,F:N,7))*(E5-D5))*B41+(L254+0.025+(E5-264)*2/(12*58))*16/19*B42*B43+(L254+5.825)*B44*16/19)*C8*C8","v":{"$error":"#VALUE!"}},null,4,48,{"$f":"'Courbe IMC'!F$51","v":14.311500000000001},13.151108108108108,11.60391891891892,{"$f":"'Courbe IMC'!F$48","v":17.056700000000003},12.377513513513515,{"$f":"G38+0.5","v":14.811500000000001},{"$f":"L38*16/19","v":12.472842105263158},{"$f":"L38*14.5/19","v":11.303513157894736}]
["Poids d'équilibre",{"$f":"((VLOOKUP(D5+5,F:I,2)+(VLOOKUP(D5+6,F:I,2)-VLOOKUP(D5+5,F:I,2))*(E5-D5))*B41+(G254+0.025+(E5-264)*2/(12*58))*B42*B43+(G254+5.825)*B44)*B8*B8","v":{"$error":"#VALUE!"}},{"$f":"((VLOOKUP(D5+5,F:N,6)+(VLOOKUP(D5+6,F:N,6)-VLOOKUP(D5+5,F:N,6))*(E5-D5))*B41+(L254+0.025+(E5-264)*2/(12*58))*B42*B43+(L254+5.825)*B44)*C8*C8","v":{"$error":"#VALUE!"}},null,null,49,{"$f":"G38-((G$38-G$50)/12)","v":14.29505},13.135991891891893,11.59058108108108,{"$f":"J38-((J$38-J$50)/12)","v":17.043902083333336},12.363286486486487,{"$f":"L38-(L38-L50)/12","v":14.79505},{"$f":"M38-(M38-M50)/12","v":12.458989473684211},{"$f":"N38-(N38-N50)/12","v":11.290959210526315}]
[null,null,null,null,null,50,{"$f":"G39-((G$38-G$50)/12)","v":14.278599999999999},13.120875675675675,11.577243243243242,{"$f":"J39-((J$38-J$50)/12)","v":17.031104166666669},12.349059459459459,{"$f":"L39-(L38-L50)/12","v":14.778599999999999},{"$f":"M39-(M38-M50)/12","v":12.445136842105263},{"$f":"N39-(N38-N50)/12","v":11.278405263157895}]
["Correction sup(age<22)",{"$f":"IF(D5/12<22,1,0)","v":0},null,null,null,51,14.262149999999998,13.105759459459458,11.563905405405404,17.018306250000002,12.334832432432432,{"$f":"L40-(L38-L50)/12","v":14.762149999999998},{"$f":"M40-(M38-M50)/12","v":12.431284210526316},{"$f":"N40-(N38-N50)/12","v":11.265851315789474}]
["Correction sup(22<age)",{"$f":"IF(D5/12>=22,1,0)","v":1},null,null,null,52,14.245699999999998,13.090643243243241,11.550567567567565,17.005508333333335,12.320605405405404,{"$f":"L41-(L38-L50)/12","v":14.745699999999998},{"$f":"M41-(M38-M50)/12","v":12.417431578947369},{"$f":"N41-(N38-N50)/12","v":11.253297368421054}]
["Correction sup(age<80)",{"$f":"IF(D5/12<=80,1,0)","v":0},null,null,null,53,14.229249999999997,13.075527027027025,11.537229729729727,16.992710416666668,12.306378378378376,{"$f":"L42-(L38-L50)/12","v":14.729249999999997},{"$f":"M42-(M38-M50)/12","v":12.403578947368421},{"$f":"N42-(N38-N50)/12","v":11.240743421052633}]
["Correction sup(age>80)",{"$f":"IF(D5/12>80,1,0)","v":1},null,null,null,54,14.212799999999996,13.060410810810806,11.523891891891889,16.979912500000001,12.292151351351349,{"$f":"L43-(L38-L50)/12","v":14.712799999999996},{"$f":"M43-(M38-M50)/12","v":12.389726315789474},{"$f":"N43-(N38-N50)/12","v":11.228189473684212}]
[null,null,null,null,null,55,14.196349999999995,13.045294594594591,11.510554054054051,16.967114583333334,12.277924324324321,{"$f":"L44-(L38-L50)/12","v":14.696349999999995},{"$f":"M44-(M38-M50)/12","v":12.375873684210527},{"$f":"N44-(N38-N50)/12","v":11.215635526315792}]
[null,null,null,null,null,56,14.179899999999995,13.030178378378373,11.497216216216211,16.954316666666667,12.263697297297293,{"$f":"L45-(L38-L50)/12","v":14.679899999999995},{"$f":"M45-(M38-M50)/12","v":12.362021052631579},{"$f":"N45-(N38-N50)/12","v":11.203081578947371}]
[null,null,null,null,null,57,14.163449999999994,13.015062162162156,11.483878378378375,16.94151875,12.249470270270265,{"$f":"L46-(L38-L50)/12","v":14.663449999999994},{"$f":"M46-(M38-M50)/12","v":12.348168421052632},{"$f":"N46-(N38-N50)/12","v":11.19052763157895}]
[null,null,null,null,null,58,14.146999999999993,12.999945945945939,11.470540540540535,16.928720833333333,12.235243243243238,{"$f":"L47-(L38-L50)/12","v":14.646999999999993},{"$f":"M47-(M38-M50)/12","v":12.334315789473685},{"$f":"N47-(N38-N50)/12","v":11.17797368421053}]
[null,null,null,null,null,59,14.130549999999992,12.984829729729723,11.457202702702697,16.915922916666666,12.22101621621621,{"$f":"L48-(L38-L50)/12","v":14.630549999999992},{"$f":"M48-(M38-M50)/12","v":12.320463157894737},{"$f":"N48-(N38-N50)/12","v":11.165419736842109}]
[null,null,null,null,5,60,{"$f":"'Courbe IMC'!G$51","v":14.114099999999999},12.969713513513513,11.443864864864864,{"$f":"'Courbe IMC'!G$48","v":16.903124999999999},12.206789189189188,{"$f":"G50+0.5","v":14.614099999999999},{"$f":"L50*16/19","v":12.306610526315788},{"$f":"L50*14.5/19","v":11.152865789473683}]
[null,null,null,null,null,61,{"$f":"G50-((G$50-G$62)/12)","v":14.0984725},12.955353108108108,11.431193918918918,{"$f":"J50-((J$50-J$62)/12)","v":16.923872916666667},12.193273513513514,{"$f":"L50-(L50-L62)/12","v":14.5984725},{"$f":"M50-(M50-M62)/12","v":12.293450526315789},{"$f":"N50-(N50-N62)/12","v":11.140939539473683}]
[null,null,null,null,null,62,{"$f":"G51-((G$50-G$62)/12)","v":14.082844999999999},12.940992702702701,11.418522972972973,{"$f":"J51-((J$50-J$62)/12)","v":16.944620833333335},12.179757837837837,{"$f":"L51-(L50-L62)/12","v":14.582844999999999},{"$f":"M51-(M50-M62)/12","v":12.28029052631579},{"$f":"N51-(N50-N62)/12","v":11.129013289473683}]
[null,null,null,null,null,63,14.067217499999998,12.926632297297296,11.405852027027025,16.965368750000003,12.16624216216216,{"$f":"L52-(L50-L62)/12","v":14.567217499999998},{"$f":"M52-(M50-M62)/12","v":12.267130526315791},{"$f":"N52-(N50-N62)/12","v":11.117087039473683}]
[null,null,null,null,null,64,14.051589999999997,12.912271891891891,11.393181081081078,16.986116666666671,12.152726486486484,{"$f":"L53-(L50-L62)/12","v":14.551589999999997},{"$f":"M53-(M50-M62)/12","v":12.253970526315792},{"$f":"N53-(N50-N62)/12","v":11.105160789473683}]
[null,null,null,null,null,65,14.035962499999997,12.897911486486482,11.380510135135133,17.006864583333339,12.139210810810807,{"$f":"L54-(L50-L62)/12","v":14.535962499999997},{"$f":"M54-(M50-M62)/12","v":12.240810526315792},{"$f":"N54-(N50-N62)/12","v":11.093234539473682}]
[null,null,null,null,null,66,14.020334999999996,12.883551081081077,11.367839189189187,17.027612500000007,12.125695135135132,{"$f":"L55-(L50-L62)/12","v":14.520334999999996},{"$f":"M55-(M50-M62)/12","v":12.227650526315793},{"$f":"N55-(N50-N62)/12","v":11.081308289473682}]
[null,null,null,null,null,67,14.004707499999995,12.869190675675672,11.35516824324324,17.048360416666675,12.112179459459455,{"$f":"L56-(L50-L62)/12","v":14.504707499999995},{"$f":"M56-(M50-M62)/12","v":12.214490526315794},{"$f":"N56-(N50-N62)/12","v":11.069382039473682}]
[null,null,null,null,null,68,13.989079999999994,12.854830270270265,11.342497297297292,17.069108333333343,12.098663783783779,{"$f":"L57-(L50-L62)/12","v":14.489079999999994},{"$f":"M57-(M50-M62)/12","v":12.201330526315795},{"$f":"N57-(N50-N62)/12","v":11.057455789473682}]
[null,null,null,null,null,69,13.973452499999993,12.840469864864859,11.329826351351345,17.089856250000011,12.085148108108102,{"$f":"L58-(L50-L62)/12","v":14.473452499999993},{"$f":"M58-(M50-M62)/12","v":12.188170526315796},{"$f":"N58-(N50-N62)/12","v":11.045529539473682}]
[null,null,null,null,null,70,13.957824999999993,12.826109459459452,11.3171554054054,17.110604166666679,12.071632432432427,{"$f":"L59-(L50-L62)/12","v":14.457824999999993},{"$f":"M59-(M50-M62)/12","v":12.175010526315797},{"$f":"N59-(N50-N62)/12","v":11.033603289473682}]
[null,null,null,null,null,71,13.942197499999992,12.811749054054047,11.304484459459452,17.131352083333347,12.05811675675675,{"$f":"L60-(L50-L62)/12","v":14.442197499999992},{"$f":"M60-(M50-M62)/12","v":12.161850526315797},{"$f":"N60-(N50-N62)/12","v":11.021677039473682}]
[null,null,null,null,6,72,{"$f":"'Courbe IMC'!H$51","v":13.92657},12.797388648648649,11.291813513513514,{"$f":"'Courbe IMC'!H$48","v":17.152100000000001},12.044601081081082,{"$f":"G62+0.5","v":14.42657},{"$f":"L62*16/19","v":12.148690526315789},{"$f":"L62*14.5/19","v":11.009750789473683}]
[null,null,null,null,null,73,{"$f":"G62-((G$62-G$74)/12)","v":13.933972499999999},12.804190945945946,11.29781554054054,{"$f":"J62-((J$62-J$74)/12)","v":17.192491666666669},12.051003243243242,{"$f":"L62-(L62-L74)/12","v":14.433972499999999},{"$f":"M62-(M62-M74)/12","v":12.154924210526316},{"$f":"N62-(N62-N74)/12","v":11.015400065789473}]
[null,null,null,null,null,74,{"$f":"G63-((G$62-G$74)/12)","v":13.941374999999999},12.810993243243242,11.303817567567567,{"$f":"J63-((J$62-J$74)/12)","v":17.232883333333337},12.057405405405405,{"$f":"L63-(L62-L74)/12","v":14.441374999999999},{"$f":"M63-(M62-M74)/12","v":12.161157894736842},{"$f":"N63-(N62-N74)/12","v":11.021049342105263}]
[null,null,null,null,null,75,13.948777499999998,12.817795540540539,11.309819594594593,17.273275000000005,12.063807567567567,{"$f":"L64-(L62-L74)/12","v":14.448777499999998},{"$f":"M64-(M62-M74)/12","v":12.167391578947369},{"$f":"N64-(N62-N74)/12","v":11.026698618421053}]
[null,null,null,null,null,76,13.956179999999998,12.824597837837835,11.31582162162162,17.313666666666673,12.070209729729727,{"$f":"L65-(L62-L74)/12","v":14.456179999999998},{"$f":"M65-(M62-M74)/12","v":12.173625263157895},{"$f":"N65-(N62-N74)/12","v":11.032347894736843}]
[null,null,null,null,null,77,13.963582499999998,{"$f":"G67*17/18.5","v":12.831400135135134},{"$f":"G67*15/18.5","v":11.321823648648646},17.354058333333342,{"$f":"G67*16/18.5","v":12.07661189189189},{"$f":"L66-(L62-L74)/12","v":14.463582499999998},{"$f":"M66-(M62-M74)/12","v":12.179858947368421},{"$f":"N66-(N62-N74)/12","v":11.037997171052632}]
[null,null,null,null,null,78,13.970984999999997,12.838202432432428,11.327825675675674,17.39445000000001,12.083014054054052,{"$f":"L67-(L62-L74)/12","v":14.470984999999997},{"$f":"M67-(M62-M74)/12","v":12.186092631578948},{"$f":"N67-(N62-N74)/12","v":11.043646447368422}]
[null,null,null,null,null,79,13.978387499999997,12.845004729729727,11.333827702702701,17.434841666666678,12.089416216216213,{"$f":"L68-(L62-L74)/12","v":14.478387499999997},{"$f":"M68-(M62-M74)/12","v":12.192326315789474},{"$f":"N68-(N62-N74)/12","v":11.049295723684212}]
[null,null,null,null,null,80,13.985789999999996,12.851807027027025,11.339829729729725,17.475233333333346,12.095818378378375,{"$f":"L69-(L62-L74)/12","v":14.485789999999996},{"$f":"M69-(M62-M74)/12","v":12.198560000000001},{"$f":"N69-(N62-N74)/12","v":11.054945000000002}]
[null,null,null,null,null,81,13.993192499999996,12.85860932432432,11.345831756756754,17.515625000000014,12.102220540540538,{"$f":"L70-(L62-L74)/12","v":14.493192499999996},{"$f":"M70-(M62-M74)/12","v":12.204793684210527},{"$f":"N70-(N62-N74)/12","v":11.060594276315792}]
[null,null,null,null,null,82,14.000594999999995,12.865411621621618,11.35183378378378,17.556016666666682,12.108622702702698,{"$f":"L71-(L62-L74)/12","v":14.500594999999995},{"$f":"M71-(M62-M74)/12","v":12.211027368421053},{"$f":"N71-(N62-N74)/12","v":11.066243552631581}]
[null,null,null,null,null,83,14.007997499999995,12.872213918918913,11.357835810810807,17.596408333333351,12.115024864864861,{"$f":"L72-(L62-L74)/12","v":14.507997499999995},{"$f":"M72-(M62-M74)/12","v":12.21726105263158},{"$f":"N72-(N62-N74)/12","v":11.071892828947371}]
[null,null,null,null,7,84,{"$f":"'Courbe IMC'!I$51","v":14.015400000000001},12.879016216216218,11.363837837837838,{"$f":"'Courbe IMC'!I$48","v":17.636800000000001},12.121427027027028,{"$f":"G74+0.5","v":14.515400000000001},{"$f":"L74*16/19","v":12.223494736842106},{"$f":"L74*14.5/19","v":11.077542105263159}]
[null,null,null,null,null,85,{"$f":"G74-((G$74-G$86)/12)","v":14.019512500000001},12.88279527027027,11.367172297297298,{"$f":"J74-((J$74-J$86)/12)","v":17.685804166666667},12.124983783783785,{"$f":"L74+(L86-L74)/12","v":14.519512500000001},{"$f":"M74+(M86-M74)/12","v":12.226957894736843},{"$f":"N74+(N86-N74)/12","v":11.080680592105264}]
[null,null,null,null,null,86,{"$f":"G75-((G$74-G$86)/12)","v":14.023625000000001},12.886574324324325,11.370506756756757,{"$f":"J75-((J$74-J$86)/12)","v":17.734808333333334},12.128540540540541,{"$f":"L75+(L86-L74)/12","v":14.523625000000001},{"$f":"M75+(M86-M74)/12","v":12.230421052631581},{"$f":"N75+(N86-N74)/12","v":11.083819078947368}]
[null,null,null,null,null,87,14.027737500000001,12.890353378378379,11.373841216216217,17.7838125,12.132097297297298,{"$f":"L76+(L86-L74)/12","v":14.527737500000001},{"$f":"M76+(M86-M74)/12","v":12.233884210526318},{"$f":"N76+(N86-N74)/12","v":11.086957565789472}]
[null,null,null,null,null,88,14.03185,12.894132432432432,11.377175675675677,17.832816666666666,12.135654054054054,{"$f":"L77+(L86-L74)/12","v":14.53185},{"$f":"M77+(M86-M74)/12","v":12.237347368421055},{"$f":"N77+(N86-N74)/12","v":11.090096052631576}]
[null,null,null,null,null,89,14.0359625,12.897911486486487,11.380510135135134,17.881820833333332,12.139210810810811,{"$f":"L78+(L86-L74)/12","v":14.5359625},{"$f":"M78+(M86-M74)/12","v":12.240810526315792},{"$f":"N78+(N86-N74)/12","v":11.093234539473681}]
[null,null,null,null,null,90,14.040075,12.901690540540541,11.383844594594594,17.930824999999999,12.142767567567567,{"$f":"L79+(L86-L74)/12","v":14.540075},{"$f":"M79+(M86-M74)/12","v":12.24427368421053},{"$f":"N79+(N86-N74)/12","v":11.096373026315785}]
[null,null,null,null,null,91,14.0441875,12.905469594594594,11.387179054054053,17.979829166666665,12.146324324324324,{"$f":"L80+(L86-L74)/12","v":14.5441875},{"$f":"M80+(M86-M74)/12","v":12.247736842105267},{"$f":"N80+(N86-N74)/12","v":11.099511513157889}]
[null,null,null,null,null,92,14.048299999999999,12.909248648648649,11.390513513513513,18.028833333333331,12.14988108108108,{"$f":"L81+(L86-L74)/12","v":14.548299999999999},{"$f":"M81+(M86-M74)/12","v":12.251200000000004},{"$f":"N81+(N86-N74)/12","v":11.102649999999993}]
[null,null,null,null,null,93,14.052412499999999,12.913027702702703,11.393847972972972,18.077837499999998,12.153437837837837,{"$f":"L82+(L86-L74)/12","v":14.552412499999999},{"$f":"M82+(M86-M74)/12","v":12.254663157894742},{"$f":"N82+(N86-N74)/12","v":11.105788486842098}]
[null,null,null,null,null,94,14.056524999999999,12.916806756756756,11.397182432432432,18.126841666666664,12.156994594594593,{"$f":"L83+(L86-L74)/12","v":14.556524999999999},{"$f":"M83+(M86-M74)/12","v":12.258126315789479},{"$f":"N83+(N86-N74)/12","v":11.108926973684202}]
[null,null,null,null,null,95,14.060637499999999,12.92058581081081,11.400516891891892,18.17584583333333,12.16055135135135,{"$f":"L84+(L86-L74)/12","v":14.560637499999999},{"$f":"M84+(M86-M74)/12","v":12.261589473684216},{"$f":"N84+(N86-N74)/12","v":11.112065460526306}]
[null,null,null,null,8,96,{"$f":"'Courbe IMC'!J$51","v":14.06475},12.924364864864865,11.403851351351351,{"$f":"'Courbe IMC'!J$48","v":18.22485},12.164108108108108,{"$f":"G86+0.5","v":14.56475},{"$f":"L86*16/19","v":12.265052631578948},{"$f":"L86*14.5/19","v":11.115203947368421}]
[null,null,null,null,null,97,{"$f":"G86-((G$86-G$98)/12)","v":14.0951825},12.952329864864865,11.428526351351351,{"$f":"J86-((J$86-J$98)/12)","v":18.280120833333335},12.190428108108108,{"$f":"L86+(L98-L86)/12","v":14.5951825},{"$f":"M86+(M98-M86)/12","v":12.29068},{"$f":"N86+(N98-N86)/12","v":11.138428749999999}]
[null,null,null,null,null,98,{"$f":"G87-((G$86-G$98)/12)","v":14.125615},12.980294864864865,11.45320135135135,{"$f":"J87-((J$86-J$98)/12)","v":18.33539166666667},12.216748108108108,{"$f":"L87+(L98-L86)/12","v":14.625615},{"$f":"M87+(M98-M86)/12","v":12.316307368421052},{"$f":"N87+(N98-N86)/12","v":11.161653552631577}]
[null,null,null,null,null,99,14.1560475,13.008259864864865,11.477876351351352,18.390662500000005,12.243068108108108,{"$f":"L88+(L98-L86)/12","v":14.6560475},{"$f":"M88+(M98-M86)/12","v":12.341934736842104},{"$f":"N88+(N98-N86)/12","v":11.184878355263155}]
[null,null,null,null,null,100,14.18648,13.036224864864863,11.502551351351352,18.44593333333334,12.269388108108108,{"$f":"L89+(L98-L86)/12","v":14.68648},{"$f":"M89+(M98-M86)/12","v":12.367562105263156},{"$f":"N89+(N98-N86)/12","v":11.208103157894733}]
[null,null,null,null,null,101,14.216912499999999,13.064189864864865,11.52722635135135,18.501204166666675,12.295708108108107,{"$f":"L90+(L98-L86)/12","v":14.716912499999999},{"$f":"M90+(M98-M86)/12","v":12.393189473684208},{"$f":"N90+(N98-N86)/12","v":11.231327960526311}]
[null,null,null,null,null,102,14.247344999999999,13.092154864864863,11.551901351351351,18.55647500000001,12.322028108108107,{"$f":"L91+(L98-L86)/12","v":14.747344999999999},{"$f":"M91+(M98-M86)/12","v":12.41881684210526},{"$f":"N91+(N98-N86)/12","v":11.254552763157889}]
[null,null,null,null,null,103,14.277777499999999,13.120119864864865,11.576576351351349,18.611745833333345,12.348348108108107,{"$f":"L92+(L98-L86)/12","v":14.777777499999999},{"$f":"M92+(M98-M86)/12","v":12.444444210526312},{"$f":"N92+(N98-N86)/12","v":11.277777565789467}]
[null,null,null,null,null,104,14.308209999999999,13.148084864864865,11.601251351351351,18.667016666666679,12.374668108108107,{"$f":"L93+(L98-L86)/12","v":14.808209999999999},{"$f":"M93+(M98-M86)/12","v":12.470071578947364},{"$f":"N93+(N98-N86)/12","v":11.301002368421045}]
[null,null,null,null,null,105,14.338642499999999,13.176049864864863,11.625926351351351,18.722287500000014,12.400988108108107,{"$f":"L94+(L98-L86)/12","v":14.838642499999999},{"$f":"M94+(M98-M86)/12","v":12.495698947368416},{"$f":"N94+(N98-N86)/12","v":11.324227171052623}]
[null,null,null,null,null,106,14.369074999999999,13.204014864864865,11.65060135135135,18.777558333333349,12.427308108108107,{"$f":"L95+(L98-L86)/12","v":14.869074999999999},{"$f":"M95+(M98-M86)/12","v":12.521326315789468},{"$f":"N95+(N98-N86)/12","v":11.347451973684201}]
[null,null,null,null,null,107,14.399507499999999,13.231979864864863,11.67527635135135,18.832829166666684,12.453628108108107,{"$f":"L96+(L98-L86)/12","v":14.899507499999999},{"$f":"M96+(M98-M86)/12","v":12.54695368421052},{"$f":"N96+(N98-N86)/12","v":11.370676776315779}]
[null,null,null,null,9,108,{"$f":"'Courbe IMC'!K$51","v":14.42994},13.259944864864865,11.699951351351352,{"$f":"'Courbe IMC'!K$48","v":18.888100000000001},12.479948108108108,{"$f":"G98+0.5","v":14.92994},{"$f":"L98*16/19","v":12.572581052631579},{"$f":"L98*14.5/19","v":11.393901578947368}]
[null,null,null,null,null,109,{"$f":"G98-((G$98-G$110)/12)","v":14.461195},13.288665675675675,11.725293243243243,{"$f":"J98-((J$98-J$110)/12)","v":18.974591666666669},12.50697945945946,{"$f":"L98+(L110-L98)/12","v":14.961195},{"$f":"M98+(M110-M98)/12","v":12.598901052631579},{"$f":"N98+(N110-N98)/12","v":11.417754078947368}]
[null,null,null,null,null,110,{"$f":"G99-((G$98-G$110)/12)","v":14.49245},13.317386486486486,11.750635135135136,{"$f":"J99-((J$98-J$110)/12)","v":19.061083333333336},12.534010810810811,{"$f":"L99+(L110-L98)/12","v":14.99245},{"$f":"M99+(M110-M98)/12","v":12.625221052631579},{"$f":"N99+(N110-N98)/12","v":11.441606578947368}]
[null,null,null,null,null,111,14.523705,13.346107297297298,11.775977027027027,19.147575000000003,12.561042162162162,{"$f":"L100+(L110-L98)/12","v":15.023705},{"$f":"M100+(M110-M98)/12","v":12.651541052631579},{"$f":"N100+(N110-N98)/12","v":11.465459078947369}]
[null,null,null,null,null,112,14.554959999999999,13.374828108108108,11.801318918918918,19.234066666666671,12.588073513513512,{"$f":"L101+(L110-L98)/12","v":15.054959999999999},{"$f":"M101+(M110-M98)/12","v":12.677861052631579},{"$f":"N101+(N110-N98)/12","v":11.489311578947369}]
[null,null,null,null,null,113,14.586214999999999,13.403548918918919,11.826660810810809,19.320558333333338,12.615104864864865,{"$f":"L102+(L110-L98)/12","v":15.086214999999999},{"$f":"M102+(M110-M98)/12","v":12.704181052631579},{"$f":"N102+(N110-N98)/12","v":11.513164078947369}]
[null,null,null,null,null,114,14.617469999999999,13.432269729729729,11.852002702702702,19.407050000000005,12.642136216216215,{"$f":"L103+(L110-L98)/12","v":15.117469999999999},{"$f":"M103+(M110-M98)/12","v":12.730501052631579},{"$f":"N103+(N110-N98)/12","v":11.53701657894737}]
[null,null,null,null,null,115,14.648724999999999,13.460990540540541,11.877344594594593,19.493541666666673,12.669167567567566,{"$f":"L104+(L110-L98)/12","v":15.148724999999999},{"$f":"M104+(M110-M98)/12","v":12.75682105263158},{"$f":"N104+(N110-N98)/12","v":11.56086907894737}]
[null,null,null,null,null,116,14.679979999999999,13.48971135135135,11.902686486486486,19.58003333333334,12.696198918918919,{"$f":"L105+(L110-L98)/12","v":15.179979999999999},{"$f":"M105+(M110-M98)/12","v":12.78314105263158},{"$f":"N105+(N110-N98)/12","v":11.58472157894737}]
[null,null,null,null,null,117,14.711234999999999,13.51843216216216,11.928028378378377,19.666525000000007,12.723230270270269,{"$f":"L106+(L110-L98)/12","v":15.211234999999999},{"$f":"M106+(M110-M98)/12","v":12.80946105263158},{"$f":"N106+(N110-N98)/12","v":11.60857407894737}]
[null,null,null,null,null,118,14.742489999999998,13.547152972972972,11.953370270270268,19.753016666666674,12.75026162162162,{"$f":"L107+(L110-L98)/12","v":15.242489999999998},{"$f":"M107+(M110-M98)/12","v":12.83578105263158},{"$f":"N107+(N110-N98)/12","v":11.632426578947371}]
[null,null,null,null,null,119,14.773744999999998,13.575873783783782,11.978712162162161,19.839508333333342,12.777292972972971,{"$f":"L108+(L110-L98)/12","v":15.273744999999998},{"$f":"M108+(M110-M98)/12","v":12.86210105263158},{"$f":"N108+(N110-N98)/12","v":11.656279078947371}]
[null,null,null,null,10,120,{"$f":"'Courbe IMC'!L$51","v":14.805},13.604594594594595,12.004054054054054,{"$f":"'Courbe IMC'!L$48","v":19.925999999999998},12.804324324324323,{"$f":"G110+0.5","v":15.305},{"$f":"L110*16/19","v":12.888421052631578},{"$f":"L110*14.5/19","v":11.680131578947368}]
[null,null,null,null,null,121,{"$f":"G110-((G$110-G$122)/12)","v":14.8502375},13.646164189189189,12.040733108108109,{"$f":"J110-((J$110-J$122)/12)","v":20.010879166666665},12.84344864864865,{"$f":"L110+(L122-L110)/12","v":15.3502375},{"$f":"M110+(M122-M110)/12","v":12.926515789473683},{"$f":"N110+(N122-N110)/12","v":11.714654934210525}]
[null,null,null,null,null,122,{"$f":"G111-((G$110-G$122)/12)","v":14.895475000000001},13.687733783783784,12.077412162162164,{"$f":"J111-((J$110-J$122)/12)","v":20.095758333333333},12.882572972972975,{"$f":"L111+(L122-L110)/12","v":15.395475000000001},{"$f":"M111+(M122-M110)/12","v":12.964610526315788},{"$f":"N111+(N122-N110)/12","v":11.749178289473683}]
[null,null,null,null,null,123,14.940712500000002,13.729303378378379,12.114091216216218,20.1806375,12.9216972972973,{"$f":"L112+(L122-L110)/12","v":15.440712500000002},{"$f":"M112+(M122-M110)/12","v":13.002705263157893},{"$f":"N112+(N122-N110)/12","v":11.783701644736841}]
[null,null,null,null,null,124,14.985950000000003,13.770872972972976,12.150770270270272,20.265516666666667,12.960821621621625,{"$f":"L113+(L122-L110)/12","v":15.485950000000003},{"$f":"M113+(M122-M110)/12","v":13.040799999999997},{"$f":"N113+(N122-N110)/12","v":11.818224999999998}]
[null,null,null,null,null,125,15.031187500000003,13.812442567567571,12.187449324324326,20.350395833333334,12.999945945945949,{"$f":"L114+(L122-L110)/12","v":15.531187500000003},{"$f":"M114+(M122-M110)/12","v":13.078894736842102},{"$f":"N114+(N122-N110)/12","v":11.852748355263156}]
[null,null,null,null,null,126,15.076425000000004,13.854012162162167,12.224128378378381,20.435275000000001,13.039070270270274,{"$f":"L115+(L122-L110)/12","v":15.576425000000004},{"$f":"M115+(M122-M110)/12","v":13.116989473684207},{"$f":"N115+(N122-N110)/12","v":11.887271710526313}]
[null,null,null,null,null,127,15.121662500000005,13.89558175675676,12.260807432432436,20.520154166666668,13.078194594594599,{"$f":"L116+(L122-L110)/12","v":15.621662500000005},{"$f":"M116+(M122-M110)/12","v":13.155084210526311},{"$f":"N116+(N122-N110)/12","v":11.921795065789471}]
[null,null,null,null,null,128,15.166900000000005,13.937151351351355,12.297486486486491,20.605033333333335,13.117318918918924,{"$f":"L117+(L122-L110)/12","v":15.666900000000005},{"$f":"M117+(M122-M110)/12","v":13.193178947368416},{"$f":"N117+(N122-N110)/12","v":11.956318421052629}]
[null,null,null,null,null,129,15.212137500000006,13.978720945945952,12.334165540540544,20.689912500000002,13.156443243243249,{"$f":"L118+(L122-L110)/12","v":15.712137500000006},{"$f":"M118+(M122-M110)/12","v":13.231273684210521},{"$f":"N118+(N122-N110)/12","v":11.990841776315786}]
[null,null,null,null,null,130,15.257375000000007,14.020290540540548,12.370844594594601,20.774791666666669,13.195567567567574,{"$f":"L119+(L122-L110)/12","v":15.757375000000007},{"$f":"M119+(M122-M110)/12","v":13.269368421052626},{"$f":"N119+(N122-N110)/12","v":12.025365131578944}]
[null,null,null,null,null,131,15.302612500000008,14.06186013513514,12.407523648648654,20.859670833333336,13.234691891891899,{"$f":"L120+(L122-L110)/12","v":15.802612500000008},{"$f":"M120+(M122-M110)/12","v":13.30746315789473},{"$f":"N120+(N122-N110)/12","v":12.059888486842102}]
[null,null,null,null,11,132,{"$f":"'Courbe IMC'!M$51","v":15.347850000000001},14.103429729729731,12.444202702702704,{"$f":"'Courbe IMC'!M$48","v":20.944550000000003},13.273816216216217,{"$f":"G122+0.5","v":15.847850000000001},{"$f":"L122*16/19","v":13.345557894736842},{"$f":"L122*14.5/19","v":12.094411842105265}]
[null,null,null,null,null,133,{"$f":"G122-((G$122-G$134)/12)","v":15.421875000000002},14.171452702702705,12.504222972972974,{"$f":"J122-((J$122-J$134)/12)","v":21.035758333333337},13.337837837837839,{"$f":"L122+(L134-L122)/12","v":15.921875000000002},{"$f":"M122+(M134-M122)/12","v":13.407894736842106},{"$f":"N122+(N134-N122)/12","v":12.150904605263159}]
[null,null,null,null,null,134,{"$f":"G123-((G$122-G$134)/12)","v":15.495900000000002},14.239475675675678,12.564243243243245,{"$f":"J123-((J$122-J$134)/12)","v":21.126966666666672},13.401859459459462,{"$f":"L123+(L134-L122)/12","v":15.995900000000002},{"$f":"M123+(M134-M122)/12","v":13.47023157894737},{"$f":"N123+(N134-N122)/12","v":12.207397368421054}]
[null,null,null,null,null,135,15.569925000000003,14.30749864864865,12.624263513513515,21.218175000000006,13.465881081081085,{"$f":"L124+(L134-L122)/12","v":16.069925000000001},{"$f":"M124+(M134-M122)/12","v":13.532568421052634},{"$f":"N124+(N134-N122)/12","v":12.263890131578949}]
[null,null,null,null,null,136,15.643950000000004,14.375521621621626,12.684283783783787,21.30938333333334,13.529902702702707,{"$f":"L125+(L134-L122)/12","v":16.14395},{"$f":"M125+(M134-M122)/12","v":13.594905263157898},{"$f":"N125+(N134-N122)/12","v":12.320382894736843}]
[null,null,null,null,null,137,15.717975000000004,14.443544594594599,12.744304054054059,21.400591666666674,13.593924324324329,{"$f":"L126+(L134-L122)/12","v":16.217974999999999},{"$f":"M126+(M134-M122)/12","v":13.657242105263162},{"$f":"N126+(N134-N122)/12","v":12.376875657894738}]
[null,null,null,null,null,138,15.792000000000005,14.511567567567573,12.804324324324329,21.491800000000008,13.657945945945951,{"$f":"L127+(L134-L122)/12","v":16.291999999999998},{"$f":"M127+(M134-M122)/12","v":13.719578947368426},{"$f":"N127+(N134-N122)/12","v":12.433368421052633}]
[null,null,null,null,null,139,15.866025000000006,14.579590540540545,12.864344594594598,21.583008333333343,13.721967567567573,{"$f":"L128+(L134-L122)/12","v":16.366024999999997},{"$f":"M128+(M134-M122)/12","v":13.78191578947369},{"$f":"N128+(N134-N122)/12","v":12.489861184210527}]
[null,null,null,null,null,140,15.940050000000006,14.647613513513518,12.92436486486487,21.674216666666677,13.785989189189195,{"$f":"L129+(L134-L122)/12","v":16.440049999999996},{"$f":"M129+(M134-M122)/12","v":13.844252631578954},{"$f":"N129+(N134-N122)/12","v":12.546353947368422}]
[null,null,null,null,null,141,16.014075000000005,{"$f":"G131*17/18.5","v":14.71563648648649},{"$f":"G131*15/18.5","v":12.98438513513514},21.765425000000011,{"$f":"G131*16/18.5","v":13.850010810810815},{"$f":"L130+(L134-L122)/12","v":16.514074999999995},{"$f":"M130+(M134-M122)/12","v":13.906589473684217},{"$f":"N130+(N134-N122)/12","v":12.602846710526316}]
[null,null,null,null,null,142,16.088100000000004,14.783659459459463,13.04440540540541,21.856633333333345,13.914032432432435,{"$f":"L131+(L134-L122)/12","v":16.588099999999994},{"$f":"M131+(M134-M122)/12","v":13.968926315789481},{"$f":"N131+(N134-N122)/12","v":12.659339473684211}]
[null,null,null,null,null,143,16.162125000000003,14.851682432432435,13.104425675675678,21.94784166666668,13.978054054054057,{"$f":"L132+(L134-L122)/12","v":16.662124999999993},{"$f":"M132+(M134-M122)/12","v":14.031263157894745},{"$f":"N132+(N134-N122)/12","v":12.715832236842106}]
[null,null,null,null,12,144,{"$f":"'Courbe IMC'!N$51","v":16.236150000000002},14.919705405405407,13.164445945945948,{"$f":"'Courbe IMC'!N$48","v":22.039050000000003},14.042075675675678,{"$f":"G134+0.5","v":16.736150000000002},{"$f":"L134*16/19","v":14.093600000000002},{"$f":"L134*14.5/19","v":12.772325}]
[null,null,null,null,null,145,{"$f":"G134-((G$134-G$146)/12)","v":16.281387500000001},14.961275000000001,13.201125000000001,{"$f":"J134-((J$134-J$146)/12)","v":22.110118750000002},14.081200000000001,{"$f":"L134+(L146-L134)/12","v":16.781387500000001},{"$f":"M134+(M146-M134)/12","v":14.131694736842107},{"$f":"N134+(N146-N134)/12","v":12.806848355263158}]
[null,null,null,null,null,146,{"$f":"G135-((G$134-G$146)/12)","v":16.326625},15.002844594594594,13.237804054054054,{"$f":"J135-((J$134-J$146)/12)","v":22.1811875},14.120324324324324,{"$f":"L135+(L146-L134)/12","v":16.826625},{"$f":"M135+(M146-M134)/12","v":14.169789473684212},{"$f":"N135+(N146-N134)/12","v":12.841371710526316}]
[null,null,null,null,null,147,16.371862499999999,15.044414189189188,13.274483108108107,22.252256249999999,14.159448648648647,{"$f":"L136+(L146-L134)/12","v":16.871862499999999},{"$f":"M136+(M146-M134)/12","v":14.207884210526316},{"$f":"N136+(N146-N134)/12","v":12.875895065789473}]
[null,null,null,null,null,148,16.417099999999998,15.085983783783782,13.311162162162161,22.323324999999997,14.198572972972972,{"$f":"L137+(L146-L134)/12","v":16.917099999999998},{"$f":"M137+(M146-M134)/12","v":14.245978947368421},{"$f":"N137+(N146-N134)/12","v":12.910418421052631}]
[null,null,null,null,null,149,16.462337499999997,15.127553378378375,13.347841216216214,22.394393749999995,14.237697297297295,{"$f":"L138+(L146-L134)/12","v":16.962337499999997},{"$f":"M138+(M146-M134)/12","v":14.284073684210526},{"$f":"N138+(N146-N134)/12","v":12.944941776315789}]
[null,null,null,null,null,150,16.507574999999996,15.169122972972968,13.384520270270267,22.465462499999994,14.276821621621618,{"$f":"L139+(L146-L134)/12","v":17.007574999999996},{"$f":"M139+(M146-M134)/12","v":14.322168421052631},{"$f":"N139+(N146-N134)/12","v":12.979465131578946}]
[null,null,null,null,null,151,16.552812499999995,15.210692567567564,13.42119932432432,22.536531249999992,14.315945945945941,{"$f":"L140+(L146-L134)/12","v":17.052812499999995},{"$f":"M140+(M146-M134)/12","v":14.360263157894735},{"$f":"N140+(N146-N134)/12","v":13.013988486842104}]
[null,null,null,null,null,152,16.598049999999994,15.252262162162157,13.457878378378373,22.607599999999991,14.355070270270264,{"$f":"L141+(L146-L134)/12","v":17.098049999999994},{"$f":"M141+(M146-M134)/12","v":14.39835789473684},{"$f":"N141+(N146-N134)/12","v":13.048511842105261}]
[null,null,null,null,null,153,16.643287499999992,15.293831756756749,13.494557432432426,22.678668749999989,14.394194594594587,{"$f":"L142+(L146-L134)/12","v":17.143287499999992},{"$f":"M142+(M146-M134)/12","v":14.436452631578945},{"$f":"N142+(N146-N134)/12","v":13.083035197368419}]
[null,null,null,null,null,154,16.688524999999991,15.335401351351342,13.531236486486479,22.749737499999988,14.433318918918911,{"$f":"L143+(L146-L134)/12","v":17.188524999999991},{"$f":"M143+(M146-M134)/12","v":14.474547368421049},{"$f":"N143+(N146-N134)/12","v":13.117558552631577}]
[null,null,null,null,null,155,16.73376249999999,15.376970945945938,13.567915540540533,22.820806249999986,14.472443243243236,{"$f":"L144+(L146-L134)/12","v":17.23376249999999},{"$f":"M144+(M146-M134)/12","v":14.512642105263154},{"$f":"N144+(N146-N134)/12","v":13.152081907894734}]
[null,null,null,null,13,156,{"$f":"'Courbe IMC'!O$51","v":16.779},15.41854054054054,13.604594594594595,{"$f":"'Courbe IMC'!O$48","v":22.891874999999999},14.511567567567567,{"$f":"G146+0.5","v":17.279},{"$f":"L146*16/19","v":14.550736842105263},{"$f":"L146*14.5/19","v":13.186605263157896}]
[null,null,null,null,null,157,{"$f":"G146-((G$146-G$158)/12)","v":16.836575},15.471447297297296,13.651277027027026,{"$f":"J146-((J$146-J$158)/12)","v":22.952393749999999},14.561362162162162,{"$f":"L146+(L158-L146)/12","v":17.336575},{"$f":"M146+(M158-M146)/12","v":14.599221052631579},{"$f":"N146+(N158-N146)/12","v":13.23054407894737}]
[null,null,null,null,null,158,{"$f":"G147-((G$146-G$158)/12)","v":16.89415},15.524354054054054,13.69795945945946,{"$f":"J147-((J$146-J$158)/12)","v":23.012912499999999},14.611156756756756,{"$f":"L147+(L158-L146)/12","v":17.39415},{"$f":"M147+(M158-M146)/12","v":14.647705263157896},{"$f":"N147+(N158-N146)/12","v":13.274482894736844}]
[null,null,null,null,null,159,16.951725,15.577260810810811,13.744641891891892,23.073431249999999,14.660951351351351,{"$f":"L148+(L158-L146)/12","v":17.451725},{"$f":"M148+(M158-M146)/12","v":14.696189473684212},{"$f":"N148+(N158-N146)/12","v":13.318421710526318}]
[null,null,null,null,null,160,17.0093,15.630167567567566,13.791324324324325,23.133949999999999,14.710745945945945,{"$f":"L149+(L158-L146)/12","v":17.5093},{"$f":"M149+(M158-M146)/12","v":14.744673684210529},{"$f":"N149+(N158-N146)/12","v":13.362360526315792}]
[null,null,null,null,null,161,17.066875,15.683074324324323,13.838006756756757,23.194468749999999,14.760540540540541,{"$f":"L150+(L158-L146)/12","v":17.566875},{"$f":"M150+(M158-M146)/12","v":14.793157894736845},{"$f":"N150+(N158-N146)/12","v":13.406299342105266}]
[null,null,null,null,null,162,17.12445,15.735981081081082,13.884689189189187,23.254987499999999,14.810335135135135,{"$f":"L151+(L158-L146)/12","v":17.62445},{"$f":"M151+(M158-M146)/12","v":14.841642105263162},{"$f":"N151+(N158-N146)/12","v":13.45023815789474}]
[null,null,null,null,null,163,17.182024999999999,15.788887837837837,13.93137162162162,23.315506249999999,14.86012972972973,{"$f":"L152+(L158-L146)/12","v":17.682024999999999},{"$f":"M152+(M158-M146)/12","v":14.890126315789479},{"$f":"N152+(N158-N146)/12","v":13.494176973684214}]
[null,null,null,null,null,164,17.239599999999999,15.841794594594594,13.978054054054054,23.376024999999998,14.909924324324324,{"$f":"L153+(L158-L146)/12","v":17.739599999999999},{"$f":"M153+(M158-M146)/12","v":14.938610526315795},{"$f":"N153+(N158-N146)/12","v":13.538115789473688}]
[null,null,null,null,null,165,17.297174999999999,15.894701351351349,14.024736486486487,23.436543749999998,14.959718918918918,{"$f":"L154+(L158-L146)/12","v":17.797174999999999},{"$f":"M154+(M158-M146)/12","v":14.987094736842112},{"$f":"N154+(N158-N146)/12","v":13.582054605263162}]
[null,null,null,null,null,166,17.354749999999999,15.947608108108108,14.071418918918917,23.497062499999998,15.009513513513513,{"$f":"L155+(L158-L146)/12","v":17.854749999999999},{"$f":"M155+(M158-M146)/12","v":15.035578947368428},{"$f":"N155+(N158-N146)/12","v":13.625993421052636}]
[null,null,null,null,null,167,17.412324999999999,16.000514864864865,14.118101351351351,23.557581249999998,15.059308108108107,{"$f":"L156+(L158-L146)/12","v":17.912324999999999},{"$f":"M156+(M158-M146)/12","v":15.084063157894745},{"$f":"N156+(N158-N146)/12","v":13.66993223684211}]
[null,null,null,null,14,168,{"$f":"'Courbe IMC'!P$51","v":17.469899999999999},16.05342162162162,14.164783783783783,{"$f":"'Courbe IMC'!P$48","v":23.618099999999998},15.109102702702701,{"$f":"G158+0.5","v":17.969899999999999},{"$f":"L158*16/19","v":15.132547368421053},{"$f":"L158*14.5/19","v":13.713871052631577}]
[null,null,null,null,null,169,{"$f":"G158-((G$158-G$170)/12)","v":17.51925},16.098770270270268,14.204797297297297,{"$f":"J158-((J$158-J$170)/12)","v":23.662556249999998},15.151783783783783,{"$f":"L158+(L170-L158)/12","v":18.01925},{"$f":"M158+(M170-M158)/12","v":15.174105263157895},{"$f":"N158+(N170-N158)/12","v":13.75153289473684}]
[null,null,null,null,null,170,{"$f":"G159-((G$158-G$170)/12)","v":17.5686},16.14411891891892,14.24481081081081,{"$f":"J159-((J$158-J$170)/12)","v":23.707012499999998},15.194464864864864,{"$f":"L159+(L170-L158)/12","v":18.0686},{"$f":"M159+(M170-M158)/12","v":15.215663157894737},{"$f":"N159+(N170-N158)/12","v":13.789194736842104}]
[null,null,null,null,null,171,17.61795,16.189467567567569,14.284824324324324,23.751468749999997,15.237145945945946,{"$f":"L160+(L170-L158)/12","v":18.11795},{"$f":"M160+(M170-M158)/12","v":15.257221052631579},{"$f":"N160+(N170-N158)/12","v":13.826856578947368}]
[null,null,null,null,null,172,17.667300000000001,16.234816216216217,14.324837837837839,23.795924999999997,15.279827027027029,{"$f":"L161+(L170-L158)/12","v":18.167300000000001},{"$f":"M161+(M170-M158)/12","v":15.298778947368421},{"$f":"N161+(N170-N158)/12","v":13.864518421052631}]
[null,null,null,null,null,173,17.716650000000001,16.280164864864865,14.364851351351351,23.840381249999997,15.32250810810811,{"$f":"L162+(L170-L158)/12","v":18.216650000000001},{"$f":"M162+(M170-M158)/12","v":15.340336842105263},{"$f":"N162+(N170-N158)/12","v":13.902180263157895}]
[null,null,null,null,null,174,17.766000000000002,16.325513513513517,14.404864864864866,23.884837499999996,15.365189189189191,{"$f":"L163+(L170-L158)/12","v":18.266000000000002},{"$f":"M163+(M170-M158)/12","v":15.381894736842105},{"$f":"N163+(N170-N158)/12","v":13.939842105263159}]
[null,null,null,null,null,175,17.815350000000002,16.370862162162165,14.444878378378379,23.929293749999996,15.407870270270273,{"$f":"L164+(L170-L158)/12","v":18.315350000000002},{"$f":"M164+(M170-M158)/12","v":15.423452631578947},{"$f":"N164+(N170-N158)/12","v":13.977503947368422}]
[null,null,null,null,null,176,17.864700000000003,16.416210810810814,14.484891891891893,23.973749999999995,15.450551351351354,{"$f":"L165+(L170-L158)/12","v":18.364700000000003},{"$f":"M165+(M170-M158)/12","v":15.465010526315789},{"$f":"N165+(N170-N158)/12","v":14.015165789473686}]
[null,null,null,null,null,177,17.914050000000003,16.461559459459462,14.524905405405409,24.018206249999995,15.493232432432436,{"$f":"L166+(L170-L158)/12","v":18.414050000000003},{"$f":"M166+(M170-M158)/12","v":15.506568421052631},{"$f":"N166+(N170-N158)/12","v":14.05282763157895}]
[null,null,null,null,null,178,17.963400000000004,16.50690810810811,14.564918918918924,24.062662499999995,15.535913513513517,{"$f":"L167+(L170-L158)/12","v":18.463400000000004},{"$f":"M167+(M170-M158)/12","v":15.548126315789473},{"$f":"N167+(N170-N158)/12","v":14.090489473684213}]
[null,null,null,null,null,179,18.012750000000004,16.552256756756758,14.604932432432436,{"$f":"J168-((J$158-J$170)/12)","v":24.107118749999994},15.578594594594598,{"$f":"L168+(L170-L158)/12","v":18.512750000000004},{"$f":"M168+(M170-M158)/12","v":15.589684210526315},{"$f":"N168+(N170-N158)/12","v":14.128151315789477}]
[null,null,null,null,15,180,{"$f":"'Courbe IMC'!Q$51","v":18.062099999999997},16.597605405405403,14.644945945945944,{"$f":"'Courbe IMC'!Q$48","v":24.151574999999998},15.621275675675673,{"$f":"G170+0.5","v":18.562099999999997},{"$f":"L170*16/19","v":15.631242105263155},{"$f":"L170*14.5/19","v":14.165813157894735}]
[null,null,null,null,null,181,{"$f":"G170-((G$170-G$182)/12)","v":18.086774999999996},16.620279729729724,14.664952702702699,{"$f":"J170-((J$170-J$182)/12)","v":24.177631249999997},15.642616216216213,{"$f":"L170+(L182-L170)/12","v":18.586774999999996},{"$f":"M170+(M182-M170)/12","v":15.652021052631577},{"$f":"N170+(N182-N170)/12","v":14.184644078947366}]
[null,null,null,null,null,182,{"$f":"G171-((G$170-G$182)/12)","v":18.111449999999998},16.642954054054051,14.684959459459458,{"$f":"J171-((J$170-J$182)/12)","v":24.203687499999997},15.663956756756756,{"$f":"L171+(L182-L170)/12","v":18.611449999999998},{"$f":"M171+(M182-M170)/12","v":15.672799999999999},{"$f":"N171+(N182-N170)/12","v":14.203474999999997}]
[null,null,null,null,null,183,18.136125,16.665628378378379,14.704966216216217,24.229743749999997,15.685297297297296,{"$f":"L172+(L182-L170)/12","v":18.636125},{"$f":"M172+(M182-M170)/12","v":15.693578947368421},{"$f":"N172+(N182-N170)/12","v":14.222305921052628}]
[null,null,null,null,null,184,18.160800000000002,16.688302702702703,14.724972972972974,24.255799999999997,15.706637837837839,{"$f":"L173+(L182-L170)/12","v":18.660800000000002},{"$f":"M173+(M182-M170)/12","v":15.714357894736843},{"$f":"N173+(N182-N170)/12","v":14.241136842105259}]
[null,null,null,null,null,185,18.185475000000004,16.710977027027031,14.744979729729733,24.281856249999997,15.727978378378381,{"$f":"L174+(L182-L170)/12","v":18.685475000000004},{"$f":"M174+(M182-M170)/12","v":15.735136842105264},{"$f":"N174+(N182-N170)/12","v":14.25996776315789}]
[null,null,null,null,null,186,18.210150000000006,16.733651351351355,14.764986486486492,24.307912499999997,15.749318918918924,{"$f":"L175+(L182-L170)/12","v":18.710150000000006},{"$f":"M175+(M182-M170)/12","v":15.755915789473686},{"$f":"N175+(N182-N170)/12","v":14.278798684210521}]
[null,null,null,null,null,187,18.234825000000008,16.756325675675683,14.78499324324325,24.333968749999997,15.770659459459466,{"$f":"L176+(L182-L170)/12","v":18.734825000000008},{"$f":"M176+(M182-M170)/12","v":15.776694736842108},{"$f":"N176+(N182-N170)/12","v":14.297629605263152}]
[null,null,null,null,null,188,18.25950000000001,16.779000000000007,14.805000000000009,24.360024999999997,15.792000000000009,{"$f":"L177+(L182-L170)/12","v":18.75950000000001},{"$f":"M177+(M182-M170)/12","v":15.79747368421053},{"$f":"N177+(N182-N170)/12","v":14.316460526315783}]
[null,null,null,null,null,189,18.284175000000012,16.801674324324335,14.825006756756768,24.386081249999997,15.813340540540551,{"$f":"L178+(L182-L170)/12","v":18.784175000000012},{"$f":"M178+(M182-M170)/12","v":15.818252631578952},{"$f":"N178+(N182-N170)/12","v":14.335291447368414}]
[null,null,null,null,null,190,18.308850000000014,16.824348648648662,14.845013513513525,24.412137499999996,15.834681081081094,{"$f":"L179+(L182-L170)/12","v":18.808850000000014},{"$f":"M179+(M182-M170)/12","v":15.839031578947374},{"$f":"N179+(N182-N170)/12","v":14.354122368421045}]
[null,null,null,null,null,191,18.333525000000016,16.847022972972987,14.865020270270284,24.438193749999996,15.856021621621636,{"$f":"L180+(L182-L170)/12","v":18.833525000000016},{"$f":"M180+(M182-M170)/12","v":15.859810526315796},{"$f":"N180+(N182-N170)/12","v":14.372953289473676}]
[null,null,null,null,16,192,{"$f":"'Courbe IMC'!R$51","v":18.3582},16.869697297297297,14.885027027027027,{"$f":"'Courbe IMC'!R$48","v":24.46425},15.877362162162163,{"$f":"G182+0.5","v":18.8582},{"$f":"L182*16/19","v":15.880589473684211},{"$f":"L182*14.5/19","v":14.391784210526316}]
[null,null,null,null,null,193,{"$f":"G182-((G$182-G$194)/12)","v":18.366425},16.877255405405403,14.891695945945946,{"$f":"J182-((J$182-J$194)/12)","v":24.486654166666668},15.884475675675676,{"$f":"L182+(L194-L182)/12","v":18.866425},{"$f":"M182+(M194-M182)/12","v":15.887515789473685},{"$f":"N182+(N194-N182)/12","v":14.398061184210526}]
[null,null,null,null,null,194,{"$f":"G183-((G$182-G$194)/12)","v":18.374649999999999},16.88481351351351,14.898364864864865,{"$f":"J183-((J$182-J$194)/12)","v":24.509058333333336},15.891589189189189,{"$f":"L183+(L194-L182)/12","v":18.874649999999999},{"$f":"M183+(M194-M182)/12","v":15.89444210526316},{"$f":"N183+(N194-N182)/12","v":14.404338157894736}]
[null,null,null,null,null,195,18.382874999999999,16.892371621621621,14.905033783783782,24.531462500000004,15.898702702702701,{"$f":"L184+(L194-L182)/12","v":18.882874999999999},{"$f":"M184+(M194-M182)/12","v":15.901368421052634},{"$f":"N184+(N194-N182)/12","v":14.410615131578947}]
[null,null,null,null,null,196,18.391099999999998,16.899929729729728,14.911702702702701,24.553866666666671,15.905816216216214,{"$f":"L185+(L194-L182)/12","v":18.891099999999998},{"$f":"M185+(M194-M182)/12","v":15.908294736842109},{"$f":"N185+(N194-N182)/12","v":14.416892105263157}]
[null,null,null,null,null,197,18.399324999999997,16.907487837837834,14.91837162162162,24.576270833333339,15.912929729729727,{"$f":"L186+(L194-L182)/12","v":18.899324999999997},{"$f":"M186+(M194-M182)/12","v":15.915221052631583},{"$f":"N186+(N194-N182)/12","v":14.423169078947367}]
[null,null,null,null,null,198,18.407549999999997,16.915045945945945,14.925040540540538,24.598675000000007,15.92004324324324,{"$f":"L187+(L194-L182)/12","v":18.907549999999997},{"$f":"M187+(M194-M182)/12","v":15.922147368421058},{"$f":"N187+(N194-N182)/12","v":14.429446052631578}]
[null,null,null,null,null,199,18.415774999999996,16.922604054054052,14.931709459459457,24.621079166666675,15.927156756756753,{"$f":"L188+(L194-L182)/12","v":18.915774999999996},{"$f":"M188+(M194-M182)/12","v":15.929073684210532},{"$f":"N188+(N194-N182)/12","v":14.435723026315788}]
[null,null,null,null,null,200,18.423999999999996,16.930162162162159,14.938378378378376,24.643483333333343,15.934270270270266,{"$f":"L189+(L194-L182)/12","v":18.923999999999996},{"$f":"M189+(M194-M182)/12","v":15.936000000000007},{"$f":"N189+(N194-N182)/12","v":14.441999999999998}]
[null,null,null,null,null,201,18.432224999999995,16.937720270270269,14.945047297297293,24.665887500000011,15.941383783783779,{"$f":"L190+(L194-L182)/12","v":18.932224999999995},{"$f":"M190+(M194-M182)/12","v":15.942926315789482},{"$f":"N190+(N194-N182)/12","v":14.448276973684209}]
[null,null,null,null,null,202,18.440449999999995,16.945278378378372,14.951716216216212,24.688291666666679,15.948497297297292,{"$f":"L191+(L194-L182)/12","v":18.940449999999995},{"$f":"M191+(M194-M182)/12","v":15.949852631578956},{"$f":"N191+(N194-N182)/12","v":14.454553947368419}]
[null,null,null,null,null,203,18.448674999999994,16.952836486486479,14.958385135135131,24.710695833333347,15.955610810810805,{"$f":"L192+(L194-L182)/12","v":18.948674999999994},{"$f":"M192+(M194-M182)/12","v":15.956778947368431},{"$f":"N192+(N194-N182)/12","v":14.460830921052629}]
[null,null,null,null,17,204,{"$f":"'Courbe IMC'!S$51","v":18.456900000000001},16.960394594594597,14.965054054054054,{"$f":"'Courbe IMC'!S$48","v":24.7331},15.962724324324325,{"$f":"G194+0.5","v":18.956900000000001},{"$f":"L194*16/19","v":15.963705263157896},{"$f":"L194*14.5/19","v":14.467107894736841}]
[null,null,null,null,null,205,{"$f":"G194-((G$194-G$206)/12)","v":18.460491666666666},{"$f":"G195*17/18.5","v":16.963695045045043},{"$f":"G195*15/18.5","v":14.967966216216217},{"$f":"J194-((J$194-J$206)/12)","v":24.755341666666666},{"$f":"G195*16/18.5","v":15.965830630630631},{"$f":"L194+(L206-L194)/12","v":18.960491666666666},{"$f":"M194+(M206-M194)/12","v":15.966729824561405},{"$f":"N194+(N206-N194)/12","v":14.469848903508771}]
[null,null,null,null,null,206,{"$f":"G195-((G$194-G$206)/12)","v":18.464083333333331},16.966995495495496,14.970878378378377,{"$f":"J195-((J$194-J$206)/12)","v":24.777583333333332},15.968936936936935,{"$f":"L195+(L206-L194)/12","v":18.964083333333331},{"$f":"M195+(M206-M194)/12","v":15.969754385964913},{"$f":"N195+(N206-N194)/12","v":14.4725899122807}]
[null,null,null,null,null,207,18.467674999999996,16.970295945945942,14.973790540540538,24.799824999999998,15.97204324324324,{"$f":"L196+(L206-L194)/12","v":18.967674999999996},{"$f":"M196+(M206-M194)/12","v":15.972778947368422},{"$f":"N196+(N206-N194)/12","v":14.475330921052629}]
[null,null,null,null,null,208,18.471266666666661,16.973596396396392,14.976702702702697,24.822066666666665,15.975149549549545,{"$f":"L197+(L206-L194)/12","v":18.971266666666661},{"$f":"M197+(M206-M194)/12","v":15.97580350877193},{"$f":"N197+(N206-N194)/12","v":14.478071929824559}]
[null,null,null,null,null,209,18.474858333333326,16.976896846846842,14.97961486486486,24.844308333333331,15.978255855855849,{"$f":"L198+(L206-L194)/12","v":18.974858333333326},{"$f":"M198+(M206-M194)/12","v":15.978828070175439},{"$f":"N198+(N206-N194)/12","v":14.480812938596488}]
[null,null,null,null,null,210,18.478449999999992,16.980197297297291,14.98252702702702,24.866549999999997,15.981362162162155,{"$f":"L199+(L206-L194)/12","v":18.978449999999992},{"$f":"M199+(M206-M194)/12","v":15.981852631578947},{"$f":"N199+(N206-N194)/12","v":14.483553947368417}]
[null,null,null,null,null,211,18.482041666666657,16.983497747747737,14.985439189189181,24.888791666666663,15.98446846846846,{"$f":"L200+(L206-L194)/12","v":18.982041666666657},{"$f":"M200+(M206-M194)/12","v":15.984877192982456},{"$f":"N200+(N206-N194)/12","v":14.486294956140346}]
[null,null,null,null,null,212,18.485633333333322,16.986798198198187,14.988351351351341,24.911033333333329,15.987574774774766,{"$f":"L201+(L206-L194)/12","v":18.985633333333322},{"$f":"M201+(M206-M194)/12","v":15.987901754385964},{"$f":"N201+(N206-N194)/12","v":14.489035964912276}]
[null,null,null,null,null,213,18.489224999999987,16.990098648648637,14.991263513513504,24.933274999999995,15.990681081081069,{"$f":"L202+(L206-L194)/12","v":18.989224999999987},{"$f":"M202+(M206-M194)/12","v":15.990926315789473},{"$f":"N202+(N206-N194)/12","v":14.491776973684205}]
[null,null,null,null,null,214,18.492816666666652,16.993399099099086,14.994175675675663,24.955516666666661,15.993787387387375,{"$f":"L203+(L206-L194)/12","v":18.992816666666652},{"$f":"M203+(M206-M194)/12","v":15.993950877192981},{"$f":"N203+(N206-N194)/12","v":14.494517982456134}]
[null,null,null,null,null,215,18.496408333333317,16.996699549549533,14.997087837837825,24.977758333333327,15.99689369369368,{"$f":"L204+(L206-L194)/12","v":18.996408333333317},{"$f":"M204+(M206-M194)/12","v":15.99697543859649},{"$f":"N204+(N206-N194)/12","v":14.497258991228064}]
[null,null,null,null,18,216,{"$f":"'Courbe IMC'!T$51","v":18.5},17,15,{"$f":"'Courbe IMC'!T$48","v":25},16,{"$f":"G206+0.5","v":19},{"$f":"L206*16/19","v":16},{"$f":"L206*14.5/19","v":14.5}]
[null,null,null,null,null,217,{"$f":"G206-((G$206-G$218)/12)","v":18.5},17,15,{"$f":"J206-((J$206-J$218)/12)","v":25},16,{"$f":"L206+(L218-L206)/12","v":19},{"$f":"M206+(M218-M206)/12","v":16},{"$f":"N206+(N218-N206)/12","v":14.5}]
[null,null,null,null,null,218,{"$f":"G207-((G$206-G$218)/12)","v":18.5},17,15,{"$f":"J207-((J$206-J$218)/12)","v":25},16,{"$f":"L207+(L218-L206)/12","v":19},{"$f":"M207+(M218-M206)/12","v":16},{"$f":"N207+(N218-N206)/12","v":14.5}]
[null,null,null,null,null,219,18.5,17,15,25,16,{"$f":"L208+(L218-L206)/12","v":19},{"$f":"M208+(M218-M206)/12","v":16},{"$f":"N208+(N218-N206)/12","v":14.5}]
[null,null,null,null,null,220,18.5,17,15,25,16,{"$f":"L209+(L218-L206)/12","v":19},{"$f":"M209+(M218-M206)/12","v":16},{"$f":"N209+(N218-N206)/12","v":14.5}]
[null,null,null,null,null,221,18.5,17,15,25,16,{"$f":"L210+(L218-L206)/12","v":19},{"$f":"M210+(M218-M206)/12","v":16},{"$f":"N210+(N218-N206)/12","v":14.5}]
[null,null,null,null,null,222,18.5,17,15,25,16,{"$f":"L211+(L218-L206)/12","v":19},{"$f":"M211+(M218-M206)/12","v":16},{"$f":"N211+(N218-N206)/12","v":14.5}]
[null,null,null,null,null,223,18.5,17,15,25,16,{"$f":"L212+(L218-L206)/12","v":19},{"$f":"M212+(M218-M206)/12","v":16},{"$f":"N212+(N218-N206)/12","v":14.5}]
[null,null,null,null,null,224,18.5,17,15,25,16,{"$f":"L213+(L218-L206)/12","v":19},{"$f":"M213+(M218-M206)/12","v":16},{"$f":"N213+(N218-N206)/12","v":14.5}]
[null,null,null,null,null,225,18.5,17,15,25,16,{"$f":"L214+(L218-L206)/12","v":19},{"$f":"M214+(M218-M206)/12","v":16},{"$f":"N214+(N218-N206)/12","v":14.5}]
[null,null,null,null,null,226,18.5,17,15,25,16,{"$f":"L215+(L218-L206)/12","v":19},{"$f":"M215+(M218-M206)/12","v":16},{"$f":"N215+(N218-N206)/12","v":14.5}]
[null,null,null,null,null,227,18.5,17,15,25,16,{"$f":"L216+(L218-L206)/12","v":19},{"$f":"M216+(M218-M206)/12","v":16},{"$f":"N216+(N218-N206)/12","v":14.5}]
[null,null,null,null,19,228,{"$f":"'Courbe IMC'!U$51","v":18.5},17,15,{"$f":"'Courbe IMC'!U$48","v":25},16,{"$f":"G218+0.5","v":19},{"$f":"L218*16/19","v":16},{"$f":"L218*14.5/19","v":14.5}]
[null,null,null,null,null,229,{"$f":"G218-((G$218-G$230)/12)","v":18.5},17,15,{"$f":"J218-((J$218-J$230)/12)","v":25},16,{"$f":"L218+(L230-L218)/12","v":19},{"$f":"M218+(M230-M218)/12","v":16},{"$f":"N218+(N230-N218)/12","v":14.5}]
[null,null,null,null,null,230,{"$f":"G219-((G$218-G$230)/12)","v":18.5},17,15,{"$f":"J219-((J$218-J$230)/12)","v":25},16,{"$f":"L219+(L230-L218)/12","v":19},{"$f":"M219+(M230-M218)/12","v":16},{"$f":"N219+(N230-N218)/12","v":14.5}]
[null,null,null,null,null,231,18.5,17,15,25,16,{"$f":"L220+(L230-L218)/12","v":19},{"$f":"M220+(M230-M218)/12","v":16},{"$f":"N220+(N230-N218)/12","v":14.5}]
[null,null,null,null,null,232,18.5,17,15,25,16,{"$f":"L221+(L230-L218)/12","v":19},{"$f":"M221+(M230-M218)/12","v":16},{"$f":"N221+(N230-N218)/12","v":14.5}]
[null,null,null,null,null,233,18.5,17,15,25,16,{"$f":"L222+(L230-L218)/12","v":19},{"$f":"M222+(M230-M218)/12","v":16},{"$f":"N222+(N230-N218)/12","v":14.5}]
[null,null,null,null,null,234,18.5,17,15,25,16,{"$f":"L223+(L230-L218)/12","v":19},{"$f":"M223+(M230-M218)/12","v":16},{"$f":"N223+(N230-N218)/12","v":14.5}]
[null,null,null,null,null,235,18.5,17,15,25,16,{"$f":"L224+(L230-L218)/12","v":19},{"$f":"M224+(M230-M218)/12","v":16},{"$f":"N224+(N230-N218)/12","v":14.5}]
[null,null,null,null,null,236,18.5,17,15,25,16,{"$f":"L225+(L230-L218)/12","v":19},{"$f":"M225+(M230-M218)/12","v":16},{"$f":"N225+(N230-N218)/12","v":14.5}]
[null,null,null,null,null,237,18.5,17,15,25,16,{"$f":"L226+(L230-L218)/12","v":19},{"$f":"M226+(M230-M218)/12","v":16},{"$f":"N226+(N230-N218)/12","v":14.5}]
[null,null,null,null,null,238,18.5,17,15,25,16,{"$f":"L227+(L230-L218)/12","v":19},{"$f":"M227+(M230-M218)/12","v":16},{"$f":"N227+(N230-N218)/12","v":14.5}]
[null,null,null,null,null,239,18.5,17,15,25,16,{"$f":"L228+(L230-L218)/12","v":19},{"$f":"M228+(M230-M218)/12","v":16},{"$f":"N228+(N230-N218)/12","v":14.5}]
[null,null,null,null,20,240,{"$f":"'Courbe IMC'!V$51","v":18.5},17,15,{"$f":"'Courbe IMC'!V$48","v":25},16,{"$f":"G230+0.5","v":19},{"$f":"L230*16/19","v":16},{"$f":"L230*14.5/19","v":14.5}]
[null,null,null,null,null,241,{"$f":"G230-((G$230-G$242)/12)","v":18.5},17,15,{"$f":"J230-((J$230-J$242)/12)","v":25},16,{"$f":"L230+(L242-L230)/12","v":19},{"$f":"M230+(M242-M230)/12","v":16},{"$f":"N230+(N242-N230)/12","v":14.5}]
[null,null,null,null,null,242,{"$f":"G231-((G$230-G$242)/12)","v":18.5},17,15,{"$f":"J231-((J$230-J$242)/12)","v":25},16,{"$f":"L231+(L242-L230)/12","v":19},{"$f":"M231+(M242-M230)/12","v":16},{"$f":"N231+(N242-N230)/12","v":14.5}]
[null,null,null,null,null,243,18.5,17,15,25,16,{"$f":"L232+(L242-L230)/12","v":19},{"$f":"M232+(M242-M230)/12","v":16},{"$f":"N232+(N242-N230)/12","v":14.5}]
[null,null,null,null,null,244,18.5,17,15,25,16,{"$f":"L233+(L242-L230)/12","v":19},{"$f":"M233+(M242-M230)/12","v":16},{"$f":"N233+(N242-N230)/12","v":14.5}]
[null,null,null,null,null,245,18.5,17,15,25,16,{"$f":"L234+(L242-L230)/12","v":19},{"$f":"M234+(M242-M230)/12","v":16},{"$f":"N234+(N242-N230)/12","v":14.5}]
[null,null,null,null,null,246,18.5,17,15,25,16,{"$f":"L235+(L242-L230)/12","v":19},{"$f":"M235+(M242-M230)/12","v":16},{"$f":"N235+(N242-N230)/12","v":14.5}]
[null,null,null,null,null,247,18.5,17,15,25,16,{"$f":"L236+(L242-L230)/12","v":19},{"$f":"M236+(M242-M230)/12","v":16},{"$f":"N236+(N242-N230)/12","v":14.5}]
[null,null,null,null,null,248,18.5,17,15,25,16,{"$f":"L237+(L242-L230)/12","v":19},{"$f":"M237+(M242-M230)/12","v":16},{"$f":"N237+(N242-N230)/12","v":14.5}]
[null,null,null,null,null,249,18.5,17,15,25,16,{"$f":"L238+(L242-L230)/12","v":19},{"$f":"M238+(M242-M230)/12","v":16},{"$f":"N238+(N242-N230)/12","v":14.5}]
[null,null,null,null,null,250,18.5,17,15,25,16,{"$f":"L239+(L242-L230)/12","v":19},{"$f":"M239+(M242-M230)/12","v":16},{"$f":"N239+(N242-N230)/12","v":14.5}]
[null,null,null,null,null,251,18.5,17,15,25,16,{"$f":"L240+(L242-L230)/12","v":19},{"$f":"M240+(M242-M230)/12","v":16},{"$f":"N240+(N242-N230)/12","v":14.5}]
[null,null,null,null,21,252,{"$f":"'Courbe IMC'!W$51","v":18.5},17,15,{"$f":"'Courbe IMC'!W$48","v":25},16,{"$f":"G242+0.5","v":19},{"$f":"L242*16/19","v":16},{"$f":"L242*14.5/19","v":14.5}]
[null,null,null,null,null,253,{"$f":"G242-((G$242-G$254)/12)","v":18.5},17,15,{"$f":"J242-((J$242-J$254)/12)","v":25},16,{"$f":"L242+(L254-L242)/12","v":19},{"$f":"M242+(M254-M242)/12","v":16},{"$f":"N242+(N254-N242)/12","v":14.5}]
[null,null,null,null,null,254,{"$f":"G243-((G$242-G$254)/12)","v":18.5},17,15,{"$f":"J243-((J$242-J$254)/12)","v":25},16,{"$f":"L243+(L254-L242)/12","v":19},{"$f":"M243+(M254-M242)/12","v":16},{"$f":"N243+(N254-N242)/12","v":14.5}]
[null,null,null,null,null,255,{"$f":"G244-((G$242-G$254)/12)","v":18.5},17,15,25,16,{"$f":"L244+(L254-L242)/12","v":19},{"$f":"M244+(M254-M242)/12","v":16},{"$f":"N244+(N254-N242)/12","v":14.5}]
[null,null,null,null,null,256,18.5,17,15,25,16,{"$f":"L245+(L254-L242)/12","v":19},{"$f":"M245+(M254-M242)/12","v":16},{"$f":"N245+(N254-N242)/12","v":14.5}]
[null,null,null,null,null,257,18.5,17,15,25,16,{"$f":"L246+(L254-L242)/12","v":19},{"$f":"M246+(M254-M242)/12","v":16},{"$f":"N246+(N254-N242)/12","v":14.5}]
[null,null,null,null,null,258,18.5,17,15,25,16,{"$f":"L247+(L254-L242)/12","v":19},{"$f":"M247+(M254-M242)/12","v":16},{"$f":"N247+(N254-N242)/12","v":14.5}]
[null,null,null,null,null,259,18.5,17,15,25,16,{"$f":"L248+(L254-L242)/12","v":19},{"$f":"M248+(M254-M242)/12","v":16},{"$f":"N248+(N254-N242)/12","v":14.5}]
[null,null,null,null,null,260,18.5,17,15,25,16,{"$f":"L249+(L254-L242)/12","v":19},{"$f":"M249+(M254-M242)/12","v":16},{"$f":"N249+(N254-N242)/12","v":14.5}]
[null,null,null,null,null,261,18.5,17,15,25,16,{"$f":"L250+(L254-L242)/12","v":19},{"$f":"M250+(M254-M242)/12","v":16},{"$f":"N250+(N254-N242)/12","v":14.5}]
[null,null,null,null,null,262,18.5,17,15,25,16,{"$f":"L251+(L254-L242)/12","v":19},{"$f":"M251+(M254-M242)/12","v":16},{"$f":"N251+(N254-N242)/12","v":14.5}]
[null,null,null,null,null,263,18.5,17,15,25,16,{"$f":"L252+(L254-L242)/12","v":19},{"$f":"M252+(M254-M242)/12","v":16},{"$f":"N252+(N254-N242)/12","v":14.5}]
[null,null,null,null,22,264,{"$f":"'Courbe IMC'!X$51","v":18.5},17,15,{"$f":"'Courbe IMC'!X$48","v":25},16,{"$f":"G254+0.5","v":19},{"$f":"L254*16/19","v":16},{"$f":"L254*14.5/19","v":14.5}]
[null,null,null,null,null,265,{"$f":"G254","v":18.5},17,15,{"$f":"'Courbe IMC'!X$6","v":21.4},16,{"$f":"1/120+L254","v":19.008333333333333},{"$f":"M254/(L254*120)+M254","v":16.00701754385965},{"$f":"N254/(L254*120)+N254","v":14.506359649122807}]
[null,null,null,null,null,266,18.5,17,15,{"$f":"'Courbe IMC'!X$6","v":21.4},16,19.016666666666666,{"$f":"M254/(L254*120)+M255","v":16.0140350877193},{"$f":"N254/(L254*120)+N255","v":14.512719298245614}]
[null,null,null,null,null,267,18.5,17,15,{"$f":"'Courbe IMC'!X$6","v":21.4},16,19.024999999999999,{"$f":"M254/(L254*120)+M256","v":16.02105263157895},{"$f":"N254/(L254*120)+N256","v":14.519078947368421}]
[null,null,null,null,null,268,18.5,17,15,{"$f":"'Courbe IMC'!X$6","v":21.4},16,19.033333333333331,{"$f":"M254/(L254*120)+M257","v":16.0280701754386},{"$f":"N254/(L254*120)+N257","v":14.525438596491227}]
[null,null,null,null,null,269,18.5,{"$f":"G259*17/18.5","v":17},{"$f":"G259*15/18.5","v":15},{"$f":"'Courbe IMC'!X$6","v":21.4},{"$f":"G259*16/18.5","v":16},19.041666666666664,{"$f":"M254/(L254*120)+M258","v":16.03508771929825},{"$f":"N254/(L254*120)+N258","v":14.531798245614034}]
[null,null,null,null,null,270,18.5,{"$f":"G260*17/18.5","v":17},{"$f":"G260*15/18.5","v":15},{"$f":"'Courbe IMC'!X$6","v":21.4},{"$f":"G260*16/18.5","v":16},19.049999999999997,{"$f":"M254/(L254*120)+M259","v":16.0421052631579},{"$f":"N254/(L254*120)+N259","v":14.538157894736841}]

{"sheet":"crises","index":20,"n_rows":43,"n_cols":3,"rows_kept":43,"cut":false,"hidden":false,"merged":[]}
[{"$f":"IF(ISBLANK(Accueil!B9),\"\",Accueil!B9)","v":""}]
[]
[null,"Crise(s)","Purge(s)"]
["S 1"]
["S 2"]
["S 3"]
["S 4"]
["S 5"]
["S 6"]
["S 7"]
["S 8"]
["S 9"]
["S 10"]
["S 11"]
["S 12"]
["S 13"]
["S 14"]
["S 15"]
["S 16"]
["S 17"]
["S 18"]
["S 19"]
["S 20"]
["S 21"]
["S 22"]
["S 23"]
["S 24"]
["S 25"]
["S 26"]
["S 27"]
["S 28"]
["S 29"]
["S 30"]
["S 31"]
["S 32"]
["S 33"]
["S 34"]
["S 35"]
["S 36"]
["S 37"]
["S 38"]
["S 39"]
["S 40"]

{"sheet":"Genogramme","index":21,"n_rows":29,"n_cols":26,"rows_kept":29,"cut":false,"hidden":false,"merged":[]}
[]
[]
[null,null,null,null,null,null,null,null,null,null,null,null,null,null,null,null,null,null,null,null,null,"Antécédents"]
[null,{"$f":"IF(ISBLANK(socio!C28),\"\",socio!C28)","v":""},null,{"$f":"IF(ISBLANK(socio!G28),\"\",socio!G28)","v":""},null,{"$f":"IF(ISBLANK(socio!C34),\"\",socio!C34)","v":""},null,{"$f":"IF(ISBLANK(socio!G34),\"\",socio!G34)","v":""},null,"Grands Parents",null,null,null,null,null,null,null,null,null,null,"GMM",1]
[null,{"$f":"IF(ISBLANK(socio!D28),\"\",socio!D28)","v":""},null,{"$f":"IF(ISBLANK(socio!H28),\"\",socio!H28)","v":""},null,{"$f":"IF(ISBLANK(socio!D34),\"\",socio!D34)","v":""},null,{"$f":"IF(ISBLANK(socio!H34),\"\",socio!H34)","v":""}]
[null,{"$f":"IF(ISBLANK(V4),\"\",VLOOKUP(V4,listes!$L$18:$M23,2))","v":"-"},null,{"$f":"IF(ISBLANK(V6),\"\",VLOOKUP(V6,listes!$L$18:$M23,2))","v":"-"},null,{"$f":"IF(ISBLANK(V8),\"\",VLOOKUP(V8,listes!$L$18:$M23,2))","v":"-"},null,{"$f":"IF(ISBLANK(V10),\"\",VLOOKUP(V10,listes!$L$18:$M23,2))","v":"-"},null,null,null,null,null,null,null,null,null,null,null,null,"GPM",1]
[]
[null,null,null,null,null,null,null,null,null,null,null,null,null,null,null,null,null,null,null,null,"GMP",1]
[null,null,null,null,null,null,null,null,null,null,{"$f":"IF(ISBLANK(R4),\"\",R4)","v":""}]
[null,null,null,null,null,null,null,null,null,null,{"$f":"IF(ISBLANK(S4),\"\",W4&\" \"&S4)","v":""},null,null,null,null,null,null,null,null,null,"GPP",1]
[]
[null,null,null,null,null,null,null,null,null,null,null,null,null,null,null,null,null,null,null,null,"P",1]
[null,null,{"$f":"IF(ISBLANK(socio!C40),\"\",socio!C40)","v":""},null,null,null,{"$f":"IF(ISBLANK(socio!G40),\"\",socio!G40)","v":""},null,null,"Parents"]
[null,null,{"$f":"IF(ISBLANK(socio!D40),\"\",socio!D40)","v":""},null,null,null,{"$f":"IF(ISBLANK(socio!H40),\"\",socio!H40)","v":""},null,null,null,null,null,null,null,null,null,null,null,null,null,"M",1]
[null,null,{"$f":"IF(ISBLANK(V14),\"\",VLOOKUP(V14,listes!$L$18:$M32,2))","v":"-"},null,null,null,{"$f":"IF(ISBLANK(V12),\"\",VLOOKUP(V12,listes!$L$18:$M32,2))","v":"-"}]
[null,null,null,null,null,null,null,null,null,null,null,null,null,null,null,null,null,null,null,{"$f":"socio!$E$8","v":0},"F1","F2","F3","F4","F5","F6"]
[null,null,null,null,null,null,null,null,null,null,null,null,null,null,null,null,null,null,null,null,{"$f":"IF(ISBLANK(socio!$C$46),\"\",socio!$C$46)","v":""},{"$f":"IF(ISBLANK(socio!$C$49),\"\",socio!$C$49)","v":""},{"$f":"IF(ISBLANK(socio!$C$52),\"\",socio!$C$52)","v":""},{"$f":"IF(ISBLANK(socio!$C$55),\"\",socio!$C$55)","v":""},{"$f":"IF(ISBLANK(socio!$C$58),\"\",socio!$C$58)","v":""},{"$f":"IF(ISBLANK(socio!$C$61),\"\",socio!$C$61)","v":""}]
[null,null,null,null,null,null,null,null,null,null,null,null,null,null,null,null,null,null,null,null,{"$f":"IF(ISBLANK(socio!$D$46),\"\",socio!$D$46)","v":""},{"$f":"IF(ISBLANK(socio!$D$49),\"\",socio!$D$49)","v":""},{"$f":"IF(ISBLANK(socio!$D$52),\"\",socio!$D$52)","v":""},{"$f":"IF(ISBLANK(socio!$D$55),\"\",socio!$D$55)","v":""},{"$f":"IF(ISBLANK(socio!$D$58),\"\",socio!$D$58)","v":""},{"$f":"IF(ISBLANK(socio!$D$61),\"\",socio!$D$61)","v":""}]
[null,null,null,null,null,null,null,null,null,null,null,null,null,null,null,null,null,null,null,null,{"$f":"IF(ISBLANK(U25),\"\",VLOOKUP(U25,listes!$L$18:$M23,2))","v":"-"},{"$f":"IF(ISBLANK(V25),\"\",VLOOKUP(V25,listes!$L$18:$M23,2))","v":"-"},{"$f":"IF(ISBLANK(W25),\"\",VLOOKUP(W25,listes!$L$18:$M23,2))","v":"-"},{"$f":"IF(ISBLANK(X25),\"\",VLOOKUP(X25,listes!$L$18:$M23,2))","v":"-"},{"$f":"IF(ISBLANK(Y25),\"\",VLOOKUP(Y25,listes!$L$18:$M23,2))","v":"-"},{"$f":"IF(ISBLANK(Z25),\"\",VLOOKUP(Z25,listes!$L$18:$M23,2))","v":"-"}]
[null,null,null,null,null,null,null,null,null,null,null,null,null,null,null,null,null,null,null,{"$f":"socio!F8","v":0},"S1","S2","S3","S4","S5","S6"]
[null,null,null,null,null,null,null,null,null,null,null,null,null,null,null,null,null,null,null,null,{"$f":"IF(ISBLANK(socio!$G$46),\"\",socio!$G$46)","v":""},{"$f":"IF(ISBLANK(socio!$G$49),\"\",socio!$G$49)","v":""},{"$f":"IF(ISBLANK(socio!$G$52),\"\",socio!$G$52)","v":""},{"$f":"IF(ISBLANK(socio!$G$55),\"\",socio!$G$55)","v":""},{"$f":"IF(ISBLANK(socio!$G$58),\"\",socio!$G$58)","v":""},{"$f":"IF(ISBLANK(socio!$G$61),\"\",socio!$G$61)","v":""}]
[null,{"$f":"U17","v":""},null,null,null,null,null,null,null,"Frère(s)",null,null,null,null,null,null,null,null,null,null,{"$f":"IF(ISBLANK(socio!$H$46),\"\",socio!$H$46)","v":""},{"$f":"IF(ISBLANK(socio!$H$49),\"\",socio!$H$49)","v":""},{"$f":"IF(ISBLANK(socio!$H$52),\"\",socio!$H$52)","v":""},{"$f":"IF(ISBLANK(socio!$H$55),\"\",socio!$H$55)","v":""},{"$f":"IF(ISBLANK(socio!$H$58),\"\",socio!$H$58)","v":""},{"$f":"IF(ISBLANK(socio!$H$61),\"\",socio!$H$61)","v":""}]
[null,{"$f":"U18","v":""},null,null,null,null,null,null,null,null,null,null,null,null,null,null,null,null,null,null,{"$f":"IF(ISBLANK(U29),\"\",VLOOKUP(U29,listes!$L$18:$M23,2))","v":"-"},{"$f":"IF(ISBLANK(V29),\"\",VLOOKUP(V29,listes!$L$18:$M23,2))","v":"-"},{"$f":"IF(ISBLANK(W29),\"\",VLOOKUP(W29,listes!$L$18:$M23,2))","v":"-"},{"$f":"IF(ISBLANK(X29),\"\",VLOOKUP(X29,listes!$L$18:$M23,2))","v":"-"},{"$f":"IF(ISBLANK(Y29),\"\",VLOOKUP(Y29,listes!$L$18:$M23,2))","v":"-"},{"$f":"IF(ISBLANK(Z29),\"\",VLOOKUP(Z29,listes!$L$18:$M23,2))","v":"-"}]
[]
[null,null,null,null,null,null,null,null,null,null,null,null,null,null,null,null,null,null,null,null,1,1,1,1,1,1]
[]
[]
[]
[null,null,null,null,null,null,null,null,null,"Sœur(s)",null,null,null,null,null,null,null,null,null,null,1,1,1,1,1,1]

{"sheet":"SilhouettesF","index":22,"n_rows":23,"n_cols":1,"rows_kept":23,"cut":false,"hidden":false,"merged":[[2,0,13,0]]}
["Test des silhouettes"]
[]
["Après avoir regardé ces silhouettes, répondez aux questions ci-dessous en déplaçant les 3 curseurs vers les positions correspondant le mieux à votre appréciation."]
[]
[]
[]
[]
[]
[]
[]
[]
[]
[]
[]
[]
[]
[]
[]
[]
[]
["Quelle silhouette vous semble la plus proche de la vôtre ?"]
["Quelle serait la silhouette idéale pour vous, celle que vous aimeriez avoir ?"]
["Quelle est, d'après vous, la silhouette correspondant le mieux à celle des personnes de votre âge ?"]

{"sheet":"SilhouettesH","index":23,"n_rows":23,"n_cols":1,"rows_kept":23,"cut":false,"hidden":false,"merged":[[2,0,13,0]]}
["Test des silhouettes"]
[]
["Après avoir regardé ces silhouettes, répondez aux questions ci-dessous en déplaçant les 3 curseurs vers les positions correspondant le mieux à votre appréciation."]
[]
[]
[]
[]
[]
[]
[]
[]
[]
[]
[]
[]
[]
[]
[]
[]
[]
["Quelle silhouette vous semble la plus proche de la vôtre ?"]
["Quelle serait la silhouette idéale pour vous, celle que vous aimeriez avoir ?"]
["Quelle est, d'après vous, la silhouette correspondant le mieux à celle des personnes de votre âge ?"]

{"sheet":"SilhFilles","index":24,"n_rows":23,"n_cols":1,"rows_kept":23,"cut":false,"hidden":false,"merged":[[2,0,13,0]]}
["Test des silhouettes"]
[]
["Après avoir regardé ces silhouettes, répondez aux questions ci-dessous en déplaçant les 3 curseurs vers les positions correspondant le mieux à votre appréciation."]
[]
[]
[]
[]
[]
[]
[]
[]
[]
[]
[]
[]
[]
[]
[]
[]
[]
["Quelle silhouette vous semble la plus proche de la vôtre ?"]
["Quelle serait la silhouette idéale pour vous, celle que vous aimeriez avoir ?"]
["Quelle est, d'après vous, la silhouette correspondant le mieux à celle des personnes de votre âge ?"]

{"sheet":"SilhGarcons","index":25,"n_rows":23,"n_cols":1,"rows_kept":23,"cut":false,"hidden":false,"merged":[[2,0,13,0]]}
["Test des silhouettes"]
[]
["Après avoir regardé ces silhouettes, répondez aux questions ci-dessous en déplaçant les 3 curseurs vers les positions correspondant le mieux à votre appréciation."]
[]
[]
[]
[]
[]
[]
[]
[]
[]
[]
[]
[]
[]
[]
[]
[]
[]
["Quelle silhouette vous semble la plus proche de la vôtre ?"]
["Quelle serait la silhouette idéale pour vous, celle que vous aimeriez avoir ?"]
["Quelle est, d'après vous, la silhouette correspondant le mieux à celle des personnes de votre âge ?"]

{"sheet":"Feuil1","index":26,"n_rows":367,"n_cols":8,"rows_kept":367,"cut":false,"hidden":false,"merged":[]}
[" ",{"$f":"IF(ISBLANK(Accueil!B8),\"sujet\",(Accueil!B8))","v":" "},"Min Norme","Surpoids","Anorexie","Obésité","Hospitalisation","Danger"]
[{"$f":"Accueil!B3","v":"2021-01-17"},{"$f":"Accueil!E3","v":0},{"$f":"HLOOKUP(A2,'Courbe In'!$AA$2:$CD$3,2)","v":{"$error":"#VALUE!"}},{"$f":"HLOOKUP(A2,'Courbe In'!$AA$2:$CD$7,5)","v":{"$error":"#VALUE!"}},{"$f":"HLOOKUP(A2,'Courbe In'!$AA$2:$CD$7,4)","v":{"$error":"#VALUE!"}},{"$f":"HLOOKUP(A2,'Courbe In'!$AA$2:$CD$7,6)","v":{"$error":"#VALUE!"}},{"$f":"HLOOKUP(A2,'Courbe In'!$AA$2:$CD$8,7)","v":{"$error":"#VALUE!"}},{"$f":"HLOOKUP(A2,'Courbe In'!$AA$2:$CD$9,8)","v":{"$error":"#VALUE!"}}]
[{"$f":"A2+1","v":"2021-01-18"},null,{"$f":"HLOOKUP(A3,'Courbe In'!$AA$2:$CD$3,2)","v":{"$error":"#VALUE!"}},{"$f":"HLOOKUP(A3,'Courbe In'!$AA$2:$CD$7,5)","v":{"$error":"#VALUE!"}},{"$f":"HLOOKUP(A3,'Courbe In'!$AA$2:$CD$7,4)","v":{"$error":"#VALUE!"}},{"$f":"HLOOKUP(A3,'Courbe In'!$AA$2:$CD$7,6)","v":{"$error":"#VALUE!"}},{"$f":"HLOOKUP(A3,'Courbe In'!$AA$2:$CD$8,7)","v":{"$error":"#VALUE!"}},{"$f":"HLOOKUP(A3,'Courbe In'!$AA$2:$CD$9,8)","v":{"$error":"#VALUE!"}}]
[{"$f":"A3+1","v":"2021-01-19"},null,{"$f":"HLOOKUP(A4,'Courbe In'!$AA$2:$CD$3,2)","v":{"$error":"#VALUE!"}},{"$f":"HLOOKUP(A4,'Courbe In'!$AA$2:$CD$7,5)","v":{"$error":"#VALUE!"}},{"$f":"HLOOKUP(A4,'Courbe In'!$AA$2:$CD$7,4)","v":{"$error":"#VALUE!"}},{"$f":"HLOOKUP(A4,'Courbe In'!$AA$2:$CD$7,6)","v":{"$error":"#VALUE!"}},{"$f":"HLOOKUP(A4,'Courbe In'!$AA$2:$CD$8,7)","v":{"$error":"#VALUE!"}},{"$f":"HLOOKUP(A4,'Courbe In'!$AA$2:$CD$9,8)","v":{"$error":"#VALUE!"}}]
["2021-01-20",null,{"$f":"HLOOKUP(A5,'Courbe In'!$AA$2:$CD$3,2)","v":{"$error":"#VALUE!"}},{"$f":"HLOOKUP(A5,'Courbe In'!$AA$2:$CD$7,5)","v":{"$error":"#VALUE!"}},{"$f":"HLOOKUP(A5,'Courbe In'!$AA$2:$CD$7,4)","v":{"$error":"#VALUE!"}},{"$f":"HLOOKUP(A5,'Courbe In'!$AA$2:$CD$7,6)","v":{"$error":"#VALUE!"}},{"$f":"HLOOKUP(A5,'Courbe In'!$AA$2:$CD$8,7)","v":{"$error":"#VALUE!"}},{"$f":"HLOOKUP(A5,'Courbe In'!$AA$2:$CD$9,8)","v":{"$error":"#VALUE!"}}]
["2021-01-21",null,{"$f":"HLOOKUP(A6,'Courbe In'!$AA$2:$CD$3,2)","v":{"$error":"#VALUE!"}},{"$f":"HLOOKUP(A6,'Courbe In'!$AA$2:$CD$7,5)","v":{"$error":"#VALUE!"}},{"$f":"HLOOKUP(A6,'Courbe In'!$AA$2:$CD$7,4)","v":{"$error":"#VALUE!"}},{"$f":"HLOOKUP(A6,'Courbe In'!$AA$2:$CD$7,6)","v":{"$error":"#VALUE!"}},{"$f":"HLOOKUP(A6,'Courbe In'!$AA$2:$CD$8,7)","v":{"$error":"#VALUE!"}},{"$f":"HLOOKUP(A6,'Courbe In'!$AA$2:$CD$9,8)","v":{"$error":"#VALUE!"}}]
["2021-01-22",null,{"$f":"HLOOKUP(A7,'Courbe In'!$AA$2:$CD$3,2)","v":{"$error":"#VALUE!"}},{"$f":"HLOOKUP(A7,'Courbe In'!$AA$2:$CD$7,5)","v":{"$error":"#VALUE!"}},{"$f":"HLOOKUP(A7,'Courbe In'!$AA$2:$CD$7,4)","v":{"$error":"#VALUE!"}},{"$f":"HLOOKUP(A7,'Courbe In'!$AA$2:$CD$7,6)","v":{"$error":"#VALUE!"}},{"$f":"HLOOKUP(A7,'Courbe In'!$AA$2:$CD$8,7)","v":{"$error":"#VALUE!"}},{"$f":"HLOOKUP(A7,'Courbe In'!$AA$2:$CD$9,8)","v":{"$error":"#VALUE!"}}]
["2021-01-23",null,{"$f":"HLOOKUP(A8,'Courbe In'!$AA$2:$CD$3,2)","v":{"$error":"#VALUE!"}},{"$f":"HLOOKUP(A8,'Courbe In'!$AA$2:$CD$7,5)","v":{"$error":"#VALUE!"}},{"$f":"HLOOKUP(A8,'Courbe In'!$AA$2:$CD$7,4)","v":{"$error":"#VALUE!"}},{"$f":"HLOOKUP(A8,'Courbe In'!$AA$2:$CD$7,6)","v":{"$error":"#VALUE!"}},{"$f":"HLOOKUP(A8,'Courbe In'!$AA$2:$CD$8,7)","v":{"$error":"#VALUE!"}},{"$f":"HLOOKUP(A8,'Courbe In'!$AA$2:$CD$9,8)","v":{"$error":"#VALUE!"}}]
["2021-01-24",null,{"$f":"HLOOKUP(A9,'Courbe In'!$AA$2:$CD$3,2)","v":{"$error":"#VALUE!"}},{"$f":"HLOOKUP(A9,'Courbe In'!$AA$2:$CD$7,5)","v":{"$error":"#VALUE!"}},{"$f":"HLOOKUP(A9,'Courbe In'!$AA$2:$CD$7,4)","v":{"$error":"#VALUE!"}},{"$f":"HLOOKUP(A9,'Courbe In'!$AA$2:$CD$7,6)","v":{"$error":"#VALUE!"}},{"$f":"HLOOKUP(A9,'Courbe In'!$AA$2:$CD$8,7)","v":{"$error":"#VALUE!"}},{"$f":"HLOOKUP(A9,'Courbe In'!$AA$2:$CD$9,8)","v":{"$error":"#VALUE!"}}]
["2021-01-25",null,{"$f":"HLOOKUP(A10,'Courbe In'!$AA$2:$CD$3,2)","v":{"$error":"#VALUE!"}},{"$f":"HLOOKUP(A10,'Courbe In'!$AA$2:$CD$7,5)","v":{"$error":"#VALUE!"}},{"$f":"HLOOKUP(A10,'Courbe In'!$AA$2:$CD$7,4)","v":{"$error":"#VALUE!"}},{"$f":"HLOOKUP(A10,'Courbe In'!$AA$2:$CD$7,6)","v":{"$error":"#VALUE!"}},{"$f":"HLOOKUP(A10,'Courbe In'!$AA$2:$CD$8,7)","v":{"$error":"#VALUE!"}},{"$f":"HLOOKUP(A10,'Courbe In'!$AA$2:$CD$9,8)","v":{"$error":"#VALUE!"}}]
["2021-01-26",null,{"$f":"HLOOKUP(A11,'Courbe In'!$AA$2:$CD$3,2)","v":{"$error":"#VALUE!"}},{"$f":"HLOOKUP(A11,'Courbe In'!$AA$2:$CD$7,5)","v":{"$error":"#VALUE!"}},{"$f":"HLOOKUP(A11,'Courbe In'!$AA$2:$CD$7,4)","v":{"$error":"#VALUE!"}},{"$f":"HLOOKUP(A11,'Courbe In'!$AA$2:$CD$7,6)","v":{"$error":"#VALUE!"}},{"$f":"HLOOKUP(A11,'Courbe In'!$AA$2:$CD$8,7)","v":{"$error":"#VALUE!"}},{"$f":"HLOOKUP(A11,'Courbe In'!$AA$2:$CD$9,8)","v":{"$error":"#VALUE!"}}]
["2021-01-27",null,{"$f":"HLOOKUP(A12,'Courbe In'!$AA$2:$CD$3,2)","v":{"$error":"#VALUE!"}},{"$f":"HLOOKUP(A12,'Courbe In'!$AA$2:$CD$7,5)","v":{"$error":"#VALUE!"}},{"$f":"HLOOKUP(A12,'Courbe In'!$AA$2:$CD$7,4)","v":{"$error":"#VALUE!"}},{"$f":"HLOOKUP(A12,'Courbe In'!$AA$2:$CD$7,6)","v":{"$error":"#VALUE!"}},{"$f":"HLOOKUP(A12,'Courbe In'!$AA$2:$CD$8,7)","v":{"$error":"#VALUE!"}},{"$f":"HLOOKUP(A12,'Courbe In'!$AA$2:$CD$9,8)","v":{"$error":"#VALUE!"}}]
["2021-01-28",null,{"$f":"HLOOKUP(A13,'Courbe In'!$AA$2:$CD$3,2)","v":{"$error":"#VALUE!"}},{"$f":"HLOOKUP(A13,'Courbe In'!$AA$2:$CD$7,5)","v":{"$error":"#VALUE!"}},{"$f":"HLOOKUP(A13,'Courbe In'!$AA$2:$CD$7,4)","v":{"$error":"#VALUE!"}},{"$f":"HLOOKUP(A13,'Courbe In'!$AA$2:$CD$7,6)","v":{"$error":"#VALUE!"}},{"$f":"HLOOKUP(A13,'Courbe In'!$AA$2:$CD$8,7)","v":{"$error":"#VALUE!"}},{"$f":"HLOOKUP(A13,'Courbe In'!$AA$2:$CD$9,8)","v":{"$error":"#VALUE!"}}]
["2021-01-29",null,{"$f":"HLOOKUP(A14,'Courbe In'!$AA$2:$CD$3,2)","v":{"$error":"#VALUE!"}},{"$f":"HLOOKUP(A14,'Courbe In'!$AA$2:$CD$7,5)","v":{"$error":"#VALUE!"}},{"$f":"HLOOKUP(A14,'Courbe In'!$AA$2:$CD$7,4)","v":{"$error":"#VALUE!"}},{"$f":"HLOOKUP(A14,'Courbe In'!$AA$2:$CD$7,6)","v":{"$error":"#VALUE!"}},{"$f":"HLOOKUP(A14,'Courbe In'!$AA$2:$CD$8,7)","v":{"$error":"#VALUE!"}},{"$f":"HLOOKUP(A14,'Courbe In'!$AA$2:$CD$9,8)","v":{"$error":"#VALUE!"}}]
["2021-01-30",null,{"$f":"HLOOKUP(A15,'Courbe In'!$AA$2:$CD$3,2)","v":{"$error":"#VALUE!"}},{"$f":"HLOOKUP(A15,'Courbe In'!$AA$2:$CD$7,5)","v":{"$error":"#VALUE!"}},{"$f":"HLOOKUP(A15,'Courbe In'!$AA$2:$CD$7,4)","v":{"$error":"#VALUE!"}},{"$f":"HLOOKUP(A15,'Courbe In'!$AA$2:$CD$7,6)","v":{"$error":"#VALUE!"}},{"$f":"HLOOKUP(A15,'Courbe In'!$AA$2:$CD$8,7)","v":{"$error":"#VALUE!"}},{"$f":"HLOOKUP(A15,'Courbe In'!$AA$2:$CD$9,8)","v":{"$error":"#VALUE!"}}]
["2021-01-31",null,{"$f":"HLOOKUP(A16,'Courbe In'!$AA$2:$CD$3,2)","v":{"$error":"#VALUE!"}},{"$f":"HLOOKUP(A16,'Courbe In'!$AA$2:$CD$7,5)","v":{"$error":"#VALUE!"}},{"$f":"HLOOKUP(A16,'Courbe In'!$AA$2:$CD$7,4)","v":{"$error":"#VALUE!"}},{"$f":"HLOOKUP(A16,'Courbe In'!$AA$2:$CD$7,6)","v":{"$error":"#VALUE!"}},{"$f":"HLOOKUP(A16,'Courbe In'!$AA$2:$CD$8,7)","v":{"$error":"#VALUE!"}},{"$f":"HLOOKUP(A16,'Courbe In'!$AA$2:$CD$9,8)","v":{"$error":"#VALUE!"}}]
["2021-02-01",null,{"$f":"HLOOKUP(A17,'Courbe In'!$AA$2:$CD$3,2)","v":{"$error":"#VALUE!"}},{"$f":"HLOOKUP(A17,'Courbe In'!$AA$2:$CD$7,5)","v":{"$error":"#VALUE!"}},{"$f":"HLOOKUP(A17,'Courbe In'!$AA$2:$CD$7,4)","v":{"$error":"#VALUE!"}},{"$f":"HLOOKUP(A17,'Courbe In'!$AA$2:$CD$7,6)","v":{"$error":"#VALUE!"}},{"$f":"HLOOKUP(A17,'Courbe In'!$AA$2:$CD$8,7)","v":{"$error":"#VALUE!"}},{"$f":"HLOOKUP(A17,'Courbe In'!$AA$2:$CD$9,8)","v":{"$error":"#VALUE!"}}]
["2021-02-02",null,{"$f":"HLOOKUP(A18,'Courbe In'!$AA$2:$CD$3,2)","v":{"$error":"#VALUE!"}},{"$f":"HLOOKUP(A18,'Courbe In'!$AA$2:$CD$7,5)","v":{"$error":"#VALUE!"}},{"$f":"HLOOKUP(A18,'Courbe In'!$AA$2:$CD$7,4)","v":{"$error":"#VALUE!"}},{"$f":"HLOOKUP(A18,'Courbe In'!$AA$2:$CD$7,6)","v":{"$error":"#VALUE!"}},{"$f":"HLOOKUP(A18,'Courbe In'!$AA$2:$CD$8,7)","v":{"$error":"#VALUE!"}},{"$f":"HLOOKUP(A18,'Courbe In'!$AA$2:$CD$9,8)","v":{"$error":"#VALUE!"}}]
["2021-02-03",null,{"$f":"HLOOKUP(A19,'Courbe In'!$AA$2:$CD$3,2)","v":{"$error":"#VALUE!"}},{"$f":"HLOOKUP(A19,'Courbe In'!$AA$2:$CD$7,5)","v":{"$error":"#VALUE!"}},{"$f":"HLOOKUP(A19,'Courbe In'!$AA$2:$CD$7,4)","v":{"$error":"#VALUE!"}},{"$f":"HLOOKUP(A19,'Courbe In'!$AA$2:$CD$7,6)","v":{"$error":"#VALUE!"}},{"$f":"HLOOKUP(A19,'Courbe In'!$AA$2:$CD$8,7)","v":{"$error":"#VALUE!"}},{"$f":"HLOOKUP(A19,'Courbe In'!$AA$2:$CD$9,8)","v":{"$error":"#VALUE!"}}]
["2021-02-04",null,{"$f":"HLOOKUP(A20,'Courbe In'!$AA$2:$CD$3,2)","v":{"$error":"#VALUE!"}},{"$f":"HLOOKUP(A20,'Courbe In'!$AA$2:$CD$7,5)","v":{"$error":"#VALUE!"}},{"$f":"HLOOKUP(A20,'Courbe In'!$AA$2:$CD$7,4)","v":{"$error":"#VALUE!"}},{"$f":"HLOOKUP(A20,'Courbe In'!$AA$2:$CD$7,6)","v":{"$error":"#VALUE!"}},{"$f":"HLOOKUP(A20,'Courbe In'!$AA$2:$CD$8,7)","v":{"$error":"#VALUE!"}},{"$f":"HLOOKUP(A20,'Courbe In'!$AA$2:$CD$9,8)","v":{"$error":"#VALUE!"}}]
["2021-02-05",null,{"$f":"HLOOKUP(A21,'Courbe In'!$AA$2:$CD$3,2)","v":{"$error":"#VALUE!"}},{"$f":"HLOOKUP(A21,'Courbe In'!$AA$2:$CD$7,5)","v":{"$error":"#VALUE!"}},{"$f":"HLOOKUP(A21,'Courbe In'!$AA$2:$CD$7,4)","v":{"$error":"#VALUE!"}},{"$f":"HLOOKUP(A21,'Courbe In'!$AA$2:$CD$7,6)","v":{"$error":"#VALUE!"}},{"$f":"HLOOKUP(A21,'Courbe In'!$AA$2:$CD$8,7)","v":{"$error":"#VALUE!"}},{"$f":"HLOOKUP(A21,'Courbe In'!$AA$2:$CD$9,8)","v":{"$error":"#VALUE!"}}]
["2021-02-06",null,{"$f":"HLOOKUP(A22,'Courbe In'!$AA$2:$CD$3,2)","v":{"$error":"#VALUE!"}},{"$f":"HLOOKUP(A22,'Courbe In'!$AA$2:$CD$7,5)","v":{"$error":"#VALUE!"}},{"$f":"HLOOKUP(A22,'Courbe In'!$AA$2:$CD$7,4)","v":{"$error":"#VALUE!"}},{"$f":"HLOOKUP(A22,'Courbe In'!$AA$2:$CD$7,6)","v":{"$error":"#VALUE!"}},{"$f":"HLOOKUP(A22,'Courbe In'!$AA$2:$CD$8,7)","v":{"$error":"#VALUE!"}},{"$f":"HLOOKUP(A22,'Courbe In'!$AA$2:$CD$9,8)","v":{"$error":"#VALUE!"}}]
["2021-02-07",null,{"$f":"HLOOKUP(A23,'Courbe In'!$AA$2:$CD$3,2)","v":{"$error":"#VALUE!"}},{"$f":"HLOOKUP(A23,'Courbe In'!$AA$2:$CD$7,5)","v":{"$error":"#VALUE!"}},{"$f":"HLOOKUP(A23,'Courbe In'!$AA$2:$CD$7,4)","v":{"$error":"#VALUE!"}},{"$f":"HLOOKUP(A23,'Courbe In'!$AA$2:$CD$7,6)","v":{"$error":"#VALUE!"}},{"$f":"HLOOKUP(A23,'Courbe In'!$AA$2:$CD$8,7)","v":{"$error":"#VALUE!"}},{"$f":"HLOOKUP(A23,'Courbe In'!$AA$2:$CD$9,8)","v":{"$error":"#VALUE!"}}]
["2021-02-08",null,{"$f":"HLOOKUP(A24,'Courbe In'!$AA$2:$CD$3,2)","v":{"$error":"#VALUE!"}},{"$f":"HLOOKUP(A24,'Courbe In'!$AA$2:$CD$7,5)","v":{"$error":"#VALUE!"}},{"$f":"HLOOKUP(A24,'Courbe In'!$AA$2:$CD$7,4)","v":{"$error":"#VALUE!"}},{"$f":"HLOOKUP(A24,'Courbe In'!$AA$2:$CD$7,6)","v":{"$error":"#VALUE!"}},{"$f":"HLOOKUP(A24,'Courbe In'!$AA$2:$CD$8,7)","v":{"$error":"#VALUE!"}},{"$f":"HLOOKUP(A24,'Courbe In'!$AA$2:$CD$9,8)","v":{"$error":"#VALUE!"}}]
["2021-02-09",null,{"$f":"HLOOKUP(A25,'Courbe In'!$AA$2:$CD$3,2)","v":{"$error":"#VALUE!"}},{"$f":"HLOOKUP(A25,'Courbe In'!$AA$2:$CD$7,5)","v":{"$error":"#VALUE!"}},{"$f":"HLOOKUP(A25,'Courbe In'!$AA$2:$CD$7,4)","v":{"$error":"#VALUE!"}},{"$f":"HLOOKUP(A25,'Courbe In'!$AA$2:$CD$7,6)","v":{"$error":"#VALUE!"}},{"$f":"HLOOKUP(A25,'Courbe In'!$AA$2:$CD$8,7)","v":{"$error":"#VALUE!"}},{"$f":"HLOOKUP(A25,'Courbe In'!$AA$2:$CD$9,8)","v":{"$error":"#VALUE!"}}]
["2021-02-10",null,{"$f":"HLOOKUP(A26,'Courbe In'!$AA$2:$CD$3,2)","v":{"$error":"#VALUE!"}},{"$f":"HLOOKUP(A26,'Courbe In'!$AA$2:$CD$7,5)","v":{"$error":"#VALUE!"}},{"$f":"HLOOKUP(A26,'Courbe In'!$AA$2:$CD$7,4)","v":{"$error":"#VALUE!"}},{"$f":"HLOOKUP(A26,'Courbe In'!$AA$2:$CD$7,6)","v":{"$error":"#VALUE!"}},{"$f":"HLOOKUP(A26,'Courbe In'!$AA$2:$CD$8,7)","v":{"$error":"#VALUE!"}},{"$f":"HLOOKUP(A26,'Courbe In'!$AA$2:$CD$9,8)","v":{"$error":"#VALUE!"}}]
["2021-02-11",null,{"$f":"HLOOKUP(A27,'Courbe In'!$AA$2:$CD$3,2)","v":{"$error":"#VALUE!"}},{"$f":"HLOOKUP(A27,'Courbe In'!$AA$2:$CD$7,5)","v":{"$error":"#VALUE!"}},{"$f":"HLOOKUP(A27,'Courbe In'!$AA$2:$CD$7,4)","v":{"$error":"#VALUE!"}},{"$f":"HLOOKUP(A27,'Courbe In'!$AA$2:$CD$7,6)","v":{"$error":"#VALUE!"}},{"$f":"HLOOKUP(A27,'Courbe In'!$AA$2:$CD$8,7)","v":{"$error":"#VALUE!"}},{"$f":"HLOOKUP(A27,'Courbe In'!$AA$2:$CD$9,8)","v":{"$error":"#VALUE!"}}]
["2021-02-12",null,{"$f":"HLOOKUP(A28,'Courbe In'!$AA$2:$CD$3,2)","v":{"$error":"#VALUE!"}},{"$f":"HLOOKUP(A28,'Courbe In'!$AA$2:$CD$7,5)","v":{"$error":"#VALUE!"}},{"$f":"HLOOKUP(A28,'Courbe In'!$AA$2:$CD$7,4)","v":{"$error":"#VALUE!"}},{"$f":"HLOOKUP(A28,'Courbe In'!$AA$2:$CD$7,6)","v":{"$error":"#VALUE!"}},{"$f":"HLOOKUP(A28,'Courbe In'!$AA$2:$CD$8,7)","v":{"$error":"#VALUE!"}},{"$f":"HLOOKUP(A28,'Courbe In'!$AA$2:$CD$9,8)","v":{"$error":"#VALUE!"}}]
["2021-02-13",null,{"$f":"HLOOKUP(A29,'Courbe In'!$AA$2:$CD$3,2)","v":{"$error":"#VALUE!"}},{"$f":"HLOOKUP(A29,'Courbe In'!$AA$2:$CD$7,5)","v":{"$error":"#VALUE!"}},{"$f":"HLOOKUP(A29,'Courbe In'!$AA$2:$CD$7,4)","v":{"$error":"#VALUE!"}},{"$f":"HLOOKUP(A29,'Courbe In'!$AA$2:$CD$7,6)","v":{"$error":"#VALUE!"}},{"$f":"HLOOKUP(A29,'Courbe In'!$AA$2:$CD$8,7)","v":{"$error":"#VALUE!"}},{"$f":"HLOOKUP(A29,'Courbe In'!$AA$2:$CD$9,8)","v":{"$error":"#VALUE!"}}]
["2021-02-14",null,{"$f":"HLOOKUP(A30,'Courbe In'!$AA$2:$CD$3,2)","v":{"$error":"#VALUE!"}},{"$f":"HLOOKUP(A30,'Courbe In'!$AA$2:$CD$7,5)","v":{"$error":"#VALUE!"}},{"$f":"HLOOKUP(A30,'Courbe In'!$AA$2:$CD$7,4)","v":{"$error":"#VALUE!"}},{"$f":"HLOOKUP(A30,'Courbe In'!$AA$2:$CD$7,6)","v":{"$error":"#VALUE!"}},{"$f":"HLOOKUP(A30,'Courbe In'!$AA$2:$CD$8,7)","v":{"$error":"#VALUE!"}},{"$f":"HLOOKUP(A30,'Courbe In'!$AA$2:$CD$9,8)","v":{"$error":"#VALUE!"}}]
["2021-02-15",null,{"$f":"HLOOKUP(A31,'Courbe In'!$AA$2:$CD$3,2)","v":{"$error":"#VALUE!"}},{"$f":"HLOOKUP(A31,'Courbe In'!$AA$2:$CD$7,5)","v":{"$error":"#VALUE!"}},{"$f":"HLOOKUP(A31,'Courbe In'!$AA$2:$CD$7,4)","v":{"$error":"#VALUE!"}},{"$f":"HLOOKUP(A31,'Courbe In'!$AA$2:$CD$7,6)","v":{"$error":"#VALUE!"}},{"$f":"HLOOKUP(A31,'Courbe In'!$AA$2:$CD$8,7)","v":{"$error":"#VALUE!"}},{"$f":"HLOOKUP(A31,'Courbe In'!$AA$2:$CD$9,8)","v":{"$error":"#VALUE!"}}]
["2021-02-16",null,{"$f":"HLOOKUP(A32,'Courbe In'!$AA$2:$CD$3,2)","v":{"$error":"#VALUE!"}},{"$f":"HLOOKUP(A32,'Courbe In'!$AA$2:$CD$7,5)","v":{"$error":"#VALUE!"}},{"$f":"HLOOKUP(A32,'Courbe In'!$AA$2:$CD$7,4)","v":{"$error":"#VALUE!"}},{"$f":"HLOOKUP(A32,'Courbe In'!$AA$2:$CD$7,6)","v":{"$error":"#VALUE!"}},{"$f":"HLOOKUP(A32,'Courbe In'!$AA$2:$CD$8,7)","v":{"$error":"#VALUE!"}},{"$f":"HLOOKUP(A32,'Courbe In'!$AA$2:$CD$9,8)","v":{"$error":"#VALUE!"}}]
["2021-02-17",null,{"$f":"HLOOKUP(A33,'Courbe In'!$AA$2:$CD$3,2)","v":{"$error":"#VALUE!"}},{"$f":"HLOOKUP(A33,'Courbe In'!$AA$2:$CD$7,5)","v":{"$error":"#VALUE!"}},{"$f":"HLOOKUP(A33,'Courbe In'!$AA$2:$CD$7,4)","v":{"$error":"#VALUE!"}},{"$f":"HLOOKUP(A33,'Courbe In'!$AA$2:$CD$7,6)","v":{"$error":"#VALUE!"}},{"$f":"HLOOKUP(A33,'Courbe In'!$AA$2:$CD$8,7)","v":{"$error":"#VALUE!"}},{"$f":"HLOOKUP(A33,'Courbe In'!$AA$2:$CD$9,8)","v":{"$error":"#VALUE!"}}]
["2021-02-18",null,{"$f":"HLOOKUP(A34,'Courbe In'!$AA$2:$CD$3,2)","v":{"$error":"#VALUE!"}},{"$f":"HLOOKUP(A34,'Courbe In'!$AA$2:$CD$7,5)","v":{"$error":"#VALUE!"}},{"$f":"HLOOKUP(A34,'Courbe In'!$AA$2:$CD$7,4)","v":{"$error":"#VALUE!"}},{"$f":"HLOOKUP(A34,'Courbe In'!$AA$2:$CD$7,6)","v":{"$error":"#VALUE!"}},{"$f":"HLOOKUP(A34,'Courbe In'!$AA$2:$CD$8,7)","v":{"$error":"#VALUE!"}},{"$f":"HLOOKUP(A34,'Courbe In'!$AA$2:$CD$9,8)","v":{"$error":"#VALUE!"}}]
["2021-02-19",null,{"$f":"HLOOKUP(A35,'Courbe In'!$AA$2:$CD$3,2)","v":{"$error":"#VALUE!"}},{"$f":"HLOOKUP(A35,'Courbe In'!$AA$2:$CD$7,5)","v":{"$error":"#VALUE!"}},{"$f":"HLOOKUP(A35,'Courbe In'!$AA$2:$CD$7,4)","v":{"$error":"#VALUE!"}},{"$f":"HLOOKUP(A35,'Courbe In'!$AA$2:$CD$7,6)","v":{"$error":"#VALUE!"}},{"$f":"HLOOKUP(A35,'Courbe In'!$AA$2:$CD$8,7)","v":{"$error":"#VALUE!"}},{"$f":"HLOOKUP(A35,'Courbe In'!$AA$2:$CD$9,8)","v":{"$error":"#VALUE!"}}]
["2021-02-20",null,{"$f":"HLOOKUP(A36,'Courbe In'!$AA$2:$CD$3,2)","v":{"$error":"#VALUE!"}},{"$f":"HLOOKUP(A36,'Courbe In'!$AA$2:$CD$7,5)","v":{"$error":"#VALUE!"}},{"$f":"HLOOKUP(A36,'Courbe In'!$AA$2:$CD$7,4)","v":{"$error":"#VALUE!"}},{"$f":"HLOOKUP(A36,'Courbe In'!$AA$2:$CD$7,6)","v":{"$error":"#VALUE!"}},{"$f":"HLOOKUP(A36,'Courbe In'!$AA$2:$CD$8,7)","v":{"$error":"#VALUE!"}},{"$f":"HLOOKUP(A36,'Courbe In'!$AA$2:$CD$9,8)","v":{"$error":"#VALUE!"}}]
["2021-02-21",null,{"$f":"HLOOKUP(A37,'Courbe In'!$AA$2:$CD$3,2)","v":{"$error":"#VALUE!"}},{"$f":"HLOOKUP(A37,'Courbe In'!$AA$2:$CD$7,5)","v":{"$error":"#VALUE!"}},{"$f":"HLOOKUP(A37,'Courbe In'!$AA$2:$CD$7,4)","v":{"$error":"#VALUE!"}},{"$f":"HLOOKUP(A37,'Courbe In'!$AA$2:$CD$7,6)","v":{"$error":"#VALUE!"}},{"$f":"HLOOKUP(A37,'Courbe In'!$AA$2:$CD$8,7)","v":{"$error":"#VALUE!"}},{"$f":"HLOOKUP(A37,'Courbe In'!$AA$2:$CD$9,8)","v":{"$error":"#VALUE!"}}]
["2021-02-22",null,{"$f":"HLOOKUP(A38,'Courbe In'!$AA$2:$CD$3,2)","v":{"$error":"#VALUE!"}},{"$f":"HLOOKUP(A38,'Courbe In'!$AA$2:$CD$7,5)","v":{"$error":"#VALUE!"}},{"$f":"HLOOKUP(A38,'Courbe In'!$AA$2:$CD$7,4)","v":{"$error":"#VALUE!"}},{"$f":"HLOOKUP(A38,'Courbe In'!$AA$2:$CD$7,6)","v":{"$error":"#VALUE!"}},{"$f":"HLOOKUP(A38,'Courbe In'!$AA$2:$CD$8,7)","v":{"$error":"#VALUE!"}},{"$f":"HLOOKUP(A38,'Courbe In'!$AA$2:$CD$9,8)","v":{"$error":"#VALUE!"}}]
["2021-02-23",null,{"$f":"HLOOKUP(A39,'Courbe In'!$AA$2:$CD$3,2)","v":{"$error":"#VALUE!"}},{"$f":"HLOOKUP(A39,'Courbe In'!$AA$2:$CD$7,5)","v":{"$error":"#VALUE!"}},{"$f":"HLOOKUP(A39,'Courbe In'!$AA$2:$CD$7,4)","v":{"$error":"#VALUE!"}},{"$f":"HLOOKUP(A39,'Courbe In'!$AA$2:$CD$7,6)","v":{"$error":"#VALUE!"}},{"$f":"HLOOKUP(A39,'Courbe In'!$AA$2:$CD$8,7)","v":{"$error":"#VALUE!"}},{"$f":"HLOOKUP(A39,'Courbe In'!$AA$2:$CD$9,8)","v":{"$error":"#VALUE!"}}]
["2021-02-24",null,{"$f":"HLOOKUP(A40,'Courbe In'!$AA$2:$CD$3,2)","v":{"$error":"#VALUE!"}},{"$f":"HLOOKUP(A40,'Courbe In'!$AA$2:$CD$7,5)","v":{"$error":"#VALUE!"}},{"$f":"HLOOKUP(A40,'Courbe In'!$AA$2:$CD$7,4)","v":{"$error":"#VALUE!"}},{"$f":"HLOOKUP(A40,'Courbe In'!$AA$2:$CD$7,6)","v":{"$error":"#VALUE!"}},{"$f":"HLOOKUP(A40,'Courbe In'!$AA$2:$CD$8,7)","v":{"$error":"#VALUE!"}},{"$f":"HLOOKUP(A40,'Courbe In'!$AA$2:$CD$9,8)","v":{"$error":"#VALUE!"}}]
["2021-02-25",null,{"$f":"HLOOKUP(A41,'Courbe In'!$AA$2:$CD$3,2)","v":{"$error":"#VALUE!"}},{"$f":"HLOOKUP(A41,'Courbe In'!$AA$2:$CD$7,5)","v":{"$error":"#VALUE!"}},{"$f":"HLOOKUP(A41,'Courbe In'!$AA$2:$CD$7,4)","v":{"$error":"#VALUE!"}},{"$f":"HLOOKUP(A41,'Courbe In'!$AA$2:$CD$7,6)","v":{"$error":"#VALUE!"}},{"$f":"HLOOKUP(A41,'Courbe In'!$AA$2:$CD$8,7)","v":{"$error":"#VALUE!"}},{"$f":"HLOOKUP(A41,'Courbe In'!$AA$2:$CD$9,8)","v":{"$error":"#VALUE!"}}]
["2021-02-26",null,{"$f":"HLOOKUP(A42,'Courbe In'!$AA$2:$CD$3,2)","v":{"$error":"#VALUE!"}},{"$f":"HLOOKUP(A42,'Courbe In'!$AA$2:$CD$7,5)","v":{"$error":"#VALUE!"}},{"$f":"HLOOKUP(A42,'Courbe In'!$AA$2:$CD$7,4)","v":{"$error":"#VALUE!"}},{"$f":"HLOOKUP(A42,'Courbe In'!$AA$2:$CD$7,6)","v":{"$error":"#VALUE!"}},{"$f":"HLOOKUP(A42,'Courbe In'!$AA$2:$CD$8,7)","v":{"$error":"#VALUE!"}},{"$f":"HLOOKUP(A42,'Courbe In'!$AA$2:$CD$9,8)","v":{"$error":"#VALUE!"}}]
["2021-02-27",null,{"$f":"HLOOKUP(A43,'Courbe In'!$AA$2:$CD$3,2)","v":{"$error":"#VALUE!"}},{"$f":"HLOOKUP(A43,'Courbe In'!$AA$2:$CD$7,5)","v":{"$error":"#VALUE!"}},{"$f":"HLOOKUP(A43,'Courbe In'!$AA$2:$CD$7,4)","v":{"$error":"#VALUE!"}},{"$f":"HLOOKUP(A43,'Courbe In'!$AA$2:$CD$7,6)","v":{"$error":"#VALUE!"}},{"$f":"HLOOKUP(A43,'Courbe In'!$AA$2:$CD$8,7)","v":{"$error":"#VALUE!"}},{"$f":"HLOOKUP(A43,'Courbe In'!$AA$2:$CD$9,8)","v":{"$error":"#VALUE!"}}]
["2021-02-28",null,{"$f":"HLOOKUP(A44,'Courbe In'!$AA$2:$CD$3,2)","v":{"$error":"#VALUE!"}},{"$f":"HLOOKUP(A44,'Courbe In'!$AA$2:$CD$7,5)","v":{"$error":"#VALUE!"}},{"$f":"HLOOKUP(A44,'Courbe In'!$AA$2:$CD$7,4)","v":{"$error":"#VALUE!"}},{"$f":"HLOOKUP(A44,'Courbe In'!$AA$2:$CD$7,6)","v":{"$error":"#VALUE!"}},{"$f":"HLOOKUP(A44,'Courbe In'!$AA$2:$CD$8,7)","v":{"$error":"#VALUE!"}},{"$f":"HLOOKUP(A44,'Courbe In'!$AA$2:$CD$9,8)","v":{"$error":"#VALUE!"}}]
["2021-03-01",null,{"$f":"HLOOKUP(A45,'Courbe In'!$AA$2:$CD$3,2)","v":{"$error":"#VALUE!"}},{"$f":"HLOOKUP(A45,'Courbe In'!$AA$2:$CD$7,5)","v":{"$error":"#VALUE!"}},{"$f":"HLOOKUP(A45,'Courbe In'!$AA$2:$CD$7,4)","v":{"$error":"#VALUE!"}},{"$f":"HLOOKUP(A45,'Courbe In'!$AA$2:$CD$7,6)","v":{"$error":"#VALUE!"}},{"$f":"HLOOKUP(A45,'Courbe In'!$AA$2:$CD$8,7)","v":{"$error":"#VALUE!"}},{"$f":"HLOOKUP(A45,'Courbe In'!$AA$2:$CD$9,8)","v":{"$error":"#VALUE!"}}]
["2021-03-02",null,{"$f":"HLOOKUP(A46,'Courbe In'!$AA$2:$CD$3,2)","v":{"$error":"#VALUE!"}},{"$f":"HLOOKUP(A46,'Courbe In'!$AA$2:$CD$7,5)","v":{"$error":"#VALUE!"}},{"$f":"HLOOKUP(A46,'Courbe In'!$AA$2:$CD$7,4)","v":{"$error":"#VALUE!"}},{"$f":"HLOOKUP(A46,'Courbe In'!$AA$2:$CD$7,6)","v":{"$error":"#VALUE!"}},{"$f":"HLOOKUP(A46,'Courbe In'!$AA$2:$CD$8,7)","v":{"$error":"#VALUE!"}},{"$f":"HLOOKUP(A46,'Courbe In'!$AA$2:$CD$9,8)","v":{"$error":"#VALUE!"}}]
["2021-03-03",null,{"$f":"HLOOKUP(A47,'Courbe In'!$AA$2:$CD$3,2)","v":{"$error":"#VALUE!"}},{"$f":"HLOOKUP(A47,'Courbe In'!$AA$2:$CD$7,5)","v":{"$error":"#VALUE!"}},{"$f":"HLOOKUP(A47,'Courbe In'!$AA$2:$CD$7,4)","v":{"$error":"#VALUE!"}},{"$f":"HLOOKUP(A47,'Courbe In'!$AA$2:$CD$7,6)","v":{"$error":"#VALUE!"}},{"$f":"HLOOKUP(A47,'Courbe In'!$AA$2:$CD$8,7)","v":{"$error":"#VALUE!"}},{"$f":"HLOOKUP(A47,'Courbe In'!$AA$2:$CD$9,8)","v":{"$error":"#VALUE!"}}]
["2021-03-04",null,{"$f":"HLOOKUP(A48,'Courbe In'!$AA$2:$CD$3,2)","v":{"$error":"#VALUE!"}},{"$f":"HLOOKUP(A48,'Courbe In'!$AA$2:$CD$7,5)","v":{"$error":"#VALUE!"}},{"$f":"HLOOKUP(A48,'Courbe In'!$AA$2:$CD$7,4)","v":{"$error":"#VALUE!"}},{"$f":"HLOOKUP(A48,'Courbe In'!$AA$2:$CD$7,6)","v":{"$error":"#VALUE!"}},{"$f":"HLOOKUP(A48,'Courbe In'!$AA$2:$CD$8,7)","v":{"$error":"#VALUE!"}},{"$f":"HLOOKUP(A48,'Courbe In'!$AA$2:$CD$9,8)","v":{"$error":"#VALUE!"}}]
["2021-03-05",null,{"$f":"HLOOKUP(A49,'Courbe In'!$AA$2:$CD$3,2)","v":{"$error":"#VALUE!"}},{"$f":"HLOOKUP(A49,'Courbe In'!$AA$2:$CD$7,5)","v":{"$error":"#VALUE!"}},{"$f":"HLOOKUP(A49,'Courbe In'!$AA$2:$CD$7,4)","v":{"$error":"#VALUE!"}},{"$f":"HLOOKUP(A49,'Courbe In'!$AA$2:$CD$7,6)","v":{"$error":"#VALUE!"}},{"$f":"HLOOKUP(A49,'Courbe In'!$AA$2:$CD$8,7)","v":{"$error":"#VALUE!"}},{"$f":"HLOOKUP(A49,'Courbe In'!$AA$2:$CD$9,8)","v":{"$error":"#VALUE!"}}]
["2021-03-06",null,{"$f":"HLOOKUP(A50,'Courbe In'!$AA$2:$CD$3,2)","v":{"$error":"#VALUE!"}},{"$f":"HLOOKUP(A50,'Courbe In'!$AA$2:$CD$7,5)","v":{"$error":"#VALUE!"}},{"$f":"HLOOKUP(A50,'Courbe In'!$AA$2:$CD$7,4)","v":{"$error":"#VALUE!"}},{"$f":"HLOOKUP(A50,'Courbe In'!$AA$2:$CD$7,6)","v":{"$error":"#VALUE!"}},{"$f":"HLOOKUP(A50,'Courbe In'!$AA$2:$CD$8,7)","v":{"$error":"#VALUE!"}},{"$f":"HLOOKUP(A50,'Courbe In'!$AA$2:$CD$9,8)","v":{"$error":"#VALUE!"}}]
["2021-03-07",null,{"$f":"HLOOKUP(A51,'Courbe In'!$AA$2:$CD$3,2)","v":{"$error":"#VALUE!"}},{"$f":"HLOOKUP(A51,'Courbe In'!$AA$2:$CD$7,5)","v":{"$error":"#VALUE!"}},{"$f":"HLOOKUP(A51,'Courbe In'!$AA$2:$CD$7,4)","v":{"$error":"#VALUE!"}},{"$f":"HLOOKUP(A51,'Courbe In'!$AA$2:$CD$7,6)","v":{"$error":"#VALUE!"}},{"$f":"HLOOKUP(A51,'Courbe In'!$AA$2:$CD$8,7)","v":{"$error":"#VALUE!"}},{"$f":"HLOOKUP(A51,'Courbe In'!$AA$2:$CD$9,8)","v":{"$error":"#VALUE!"}}]
["2021-03-08",null,{"$f":"HLOOKUP(A52,'Courbe In'!$AA$2:$CD$3,2)","v":{"$error":"#VALUE!"}},{"$f":"HLOOKUP(A52,'Courbe In'!$AA$2:$CD$7,5)","v":{"$error":"#VALUE!"}},{"$f":"HLOOKUP(A52,'Courbe In'!$AA$2:$CD$7,4)","v":{"$error":"#VALUE!"}},{"$f":"HLOOKUP(A52,'Courbe In'!$AA$2:$CD$7,6)","v":{"$error":"#VALUE!"}},{"$f":"HLOOKUP(A52,'Courbe In'!$AA$2:$CD$8,7)","v":{"$error":"#VALUE!"}},{"$f":"HLOOKUP(A52,'Courbe In'!$AA$2:$CD$9,8)","v":{"$error":"#VALUE!"}}]
["2021-03-09",null,{"$f":"HLOOKUP(A53,'Courbe In'!$AA$2:$CD$3,2)","v":{"$error":"#VALUE!"}},{"$f":"HLOOKUP(A53,'Courbe In'!$AA$2:$CD$7,5)","v":{"$error":"#VALUE!"}},{"$f":"HLOOKUP(A53,'Courbe In'!$AA$2:$CD$7,4)","v":{"$error":"#VALUE!"}},{"$f":"HLOOKUP(A53,'Courbe In'!$AA$2:$CD$7,6)","v":{"$error":"#VALUE!"}},{"$f":"HLOOKUP(A53,'Courbe In'!$AA$2:$CD$8,7)","v":{"$error":"#VALUE!"}},{"$f":"HLOOKUP(A53,'Courbe In'!$AA$2:$CD$9,8)","v":{"$error":"#VALUE!"}}]
["2021-03-10",null,{"$f":"HLOOKUP(A54,'Courbe In'!$AA$2:$CD$3,2)","v":{"$error":"#VALUE!"}},{"$f":"HLOOKUP(A54,'Courbe In'!$AA$2:$CD$7,5)","v":{"$error":"#VALUE!"}},{"$f":"HLOOKUP(A54,'Courbe In'!$AA$2:$CD$7,4)","v":{"$error":"#VALUE!"}},{"$f":"HLOOKUP(A54,'Courbe In'!$AA$2:$CD$7,6)","v":{"$error":"#VALUE!"}},{"$f":"HLOOKUP(A54,'Courbe In'!$AA$2:$CD$8,7)","v":{"$error":"#VALUE!"}},{"$f":"HLOOKUP(A54,'Courbe In'!$AA$2:$CD$9,8)","v":{"$error":"#VALUE!"}}]
["2021-03-11",null,{"$f":"HLOOKUP(A55,'Courbe In'!$AA$2:$CD$3,2)","v":{"$error":"#VALUE!"}},{"$f":"HLOOKUP(A55,'Courbe In'!$AA$2:$CD$7,5)","v":{"$error":"#VALUE!"}},{"$f":"HLOOKUP(A55,'Courbe In'!$AA$2:$CD$7,4)","v":{"$error":"#VALUE!"}},{"$f":"HLOOKUP(A55,'Courbe In'!$AA$2:$CD$7,6)","v":{"$error":"#VALUE!"}},{"$f":"HLOOKUP(A55,'Courbe In'!$AA$2:$CD$8,7)","v":{"$error":"#VALUE!"}},{"$f":"HLOOKUP(A55,'Courbe In'!$AA$2:$CD$9,8)","v":{"$error":"#VALUE!"}}]
["2021-03-12",null,{"$f":"HLOOKUP(A56,'Courbe In'!$AA$2:$CD$3,2)","v":{"$error":"#VALUE!"}},{"$f":"HLOOKUP(A56,'Courbe In'!$AA$2:$CD$7,5)","v":{"$error":"#VALUE!"}},{"$f":"HLOOKUP(A56,'Courbe In'!$AA$2:$CD$7,4)","v":{"$error":"#VALUE!"}},{"$f":"HLOOKUP(A56,'Courbe In'!$AA$2:$CD$7,6)","v":{"$error":"#VALUE!"}},{"$f":"HLOOKUP(A56,'Courbe In'!$AA$2:$CD$8,7)","v":{"$error":"#VALUE!"}},{"$f":"HLOOKUP(A56,'Courbe In'!$AA$2:$CD$9,8)","v":{"$error":"#VALUE!"}}]
["2021-03-13",null,{"$f":"HLOOKUP(A57,'Courbe In'!$AA$2:$CD$3,2)","v":{"$error":"#VALUE!"}},{"$f":"HLOOKUP(A57,'Courbe In'!$AA$2:$CD$7,5)","v":{"$error":"#VALUE!"}},{"$f":"HLOOKUP(A57,'Courbe In'!$AA$2:$CD$7,4)","v":{"$error":"#VALUE!"}},{"$f":"HLOOKUP(A57,'Courbe In'!$AA$2:$CD$7,6)","v":{"$error":"#VALUE!"}},{"$f":"HLOOKUP(A57,'Courbe In'!$AA$2:$CD$8,7)","v":{"$error":"#VALUE!"}},{"$f":"HLOOKUP(A57,'Courbe In'!$AA$2:$CD$9,8)","v":{"$error":"#VALUE!"}}]
["2021-03-14",null,{"$f":"HLOOKUP(A58,'Courbe In'!$AA$2:$CD$3,2)","v":{"$error":"#VALUE!"}},{"$f":"HLOOKUP(A58,'Courbe In'!$AA$2:$CD$7,5)","v":{"$error":"#VALUE!"}},{"$f":"HLOOKUP(A58,'Courbe In'!$AA$2:$CD$7,4)","v":{"$error":"#VALUE!"}},{"$f":"HLOOKUP(A58,'Courbe In'!$AA$2:$CD$7,6)","v":{"$error":"#VALUE!"}},{"$f":"HLOOKUP(A58,'Courbe In'!$AA$2:$CD$8,7)","v":{"$error":"#VALUE!"}},{"$f":"HLOOKUP(A58,'Courbe In'!$AA$2:$CD$9,8)","v":{"$error":"#VALUE!"}}]
["2021-03-15",null,{"$f":"HLOOKUP(A59,'Courbe In'!$AA$2:$CD$3,2)","v":{"$error":"#VALUE!"}},{"$f":"HLOOKUP(A59,'Courbe In'!$AA$2:$CD$7,5)","v":{"$error":"#VALUE!"}},{"$f":"HLOOKUP(A59,'Courbe In'!$AA$2:$CD$7,4)","v":{"$error":"#VALUE!"}},{"$f":"HLOOKUP(A59,'Courbe In'!$AA$2:$CD$7,6)","v":{"$error":"#VALUE!"}},{"$f":"HLOOKUP(A59,'Courbe In'!$AA$2:$CD$8,7)","v":{"$error":"#VALUE!"}},{"$f":"HLOOKUP(A59,'Courbe In'!$AA$2:$CD$9,8)","v":{"$error":"#VALUE!"}}]
["2021-03-16",null,{"$f":"HLOOKUP(A60,'Courbe In'!$AA$2:$CD$3,2)","v":{"$error":"#VALUE!"}},{"$f":"HLOOKUP(A60,'Courbe In'!$AA$2:$CD$7,5)","v":{"$error":"#VALUE!"}},{"$f":"HLOOKUP(A60,'Courbe In'!$AA$2:$CD$7,4)","v":{"$error":"#VALUE!"}},{"$f":"HLOOKUP(A60,'Courbe In'!$AA$2:$CD$7,6)","v":{"$error":"#VALUE!"}},{"$f":"HLOOKUP(A60,'Courbe In'!$AA$2:$CD$8,7)","v":{"$error":"#VALUE!"}},{"$f":"HLOOKUP(A60,'Courbe In'!$AA$2:$CD$9,8)","v":{"$error":"#VALUE!"}}]
["2021-03-17",null,{"$f":"HLOOKUP(A61,'Courbe In'!$AA$2:$CD$3,2)","v":{"$error":"#VALUE!"}},{"$f":"HLOOKUP(A61,'Courbe In'!$AA$2:$CD$7,5)","v":{"$error":"#VALUE!"}},{"$f":"HLOOKUP(A61,'Courbe In'!$AA$2:$CD$7,4)","v":{"$error":"#VALUE!"}},{"$f":"HLOOKUP(A61,'Courbe In'!$AA$2:$CD$7,6)","v":{"$error":"#VALUE!"}},{"$f":"HLOOKUP(A61,'Courbe In'!$AA$2:$CD$8,7)","v":{"$error":"#VALUE!"}},{"$f":"HLOOKUP(A61,'Courbe In'!$AA$2:$CD$9,8)","v":{"$error":"#VALUE!"}}]
["2021-03-18",null,{"$f":"HLOOKUP(A62,'Courbe In'!$AA$2:$CD$3,2)","v":{"$error":"#VALUE!"}},{"$f":"HLOOKUP(A62,'Courbe In'!$AA$2:$CD$7,5)","v":{"$error":"#VALUE!"}},{"$f":"HLOOKUP(A62,'Courbe In'!$AA$2:$CD$7,4)","v":{"$error":"#VALUE!"}},{"$f":"HLOOKUP(A62,'Courbe In'!$AA$2:$CD$7,6)","v":{"$error":"#VALUE!"}},{"$f":"HLOOKUP(A62,'Courbe In'!$AA$2:$CD$8,7)","v":{"$error":"#VALUE!"}},{"$f":"HLOOKUP(A62,'Courbe In'!$AA$2:$CD$9,8)","v":{"$error":"#VALUE!"}}]
["2021-03-19",null,{"$f":"HLOOKUP(A63,'Courbe In'!$AA$2:$CD$3,2)","v":{"$error":"#VALUE!"}},{"$f":"HLOOKUP(A63,'Courbe In'!$AA$2:$CD$7,5)","v":{"$error":"#VALUE!"}},{"$f":"HLOOKUP(A63,'Courbe In'!$AA$2:$CD$7,4)","v":{"$error":"#VALUE!"}},{"$f":"HLOOKUP(A63,'Courbe In'!$AA$2:$CD$7,6)","v":{"$error":"#VALUE!"}},{"$f":"HLOOKUP(A63,'Courbe In'!$AA$2:$CD$8,7)","v":{"$error":"#VALUE!"}},{"$f":"HLOOKUP(A63,'Courbe In'!$AA$2:$CD$9,8)","v":{"$error":"#VALUE!"}}]
["2021-03-20",null,{"$f":"HLOOKUP(A64,'Courbe In'!$AA$2:$CD$3,2)","v":{"$error":"#VALUE!"}},{"$f":"HLOOKUP(A64,'Courbe In'!$AA$2:$CD$7,5)","v":{"$error":"#VALUE!"}},{"$f":"HLOOKUP(A64,'Courbe In'!$AA$2:$CD$7,4)","v":{"$error":"#VALUE!"}},{"$f":"HLOOKUP(A64,'Courbe In'!$AA$2:$CD$7,6)","v":{"$error":"#VALUE!"}},{"$f":"HLOOKUP(A64,'Courbe In'!$AA$2:$CD$8,7)","v":{"$error":"#VALUE!"}},{"$f":"HLOOKUP(A64,'Courbe In'!$AA$2:$CD$9,8)","v":{"$error":"#VALUE!"}}]
["2021-03-21",null,{"$f":"HLOOKUP(A65,'Courbe In'!$AA$2:$CD$3,2)","v":{"$error":"#VALUE!"}},{"$f":"HLOOKUP(A65,'Courbe In'!$AA$2:$CD$7,5)","v":{"$error":"#VALUE!"}},{"$f":"HLOOKUP(A65,'Courbe In'!$AA$2:$CD$7,4)","v":{"$error":"#VALUE!"}},{"$f":"HLOOKUP(A65,'Courbe In'!$AA$2:$CD$7,6)","v":{"$error":"#VALUE!"}},{"$f":"HLOOKUP(A65,'Courbe In'!$AA$2:$CD$8,7)","v":{"$error":"#VALUE!"}},{"$f":"HLOOKUP(A65,'Courbe In'!$AA$2:$CD$9,8)","v":{"$error":"#VALUE!"}}]
["2021-03-22",null,{"$f":"HLOOKUP(A66,'Courbe In'!$AA$2:$CD$3,2)","v":{"$error":"#VALUE!"}},{"$f":"HLOOKUP(A66,'Courbe In'!$AA$2:$CD$7,5)","v":{"$error":"#VALUE!"}},{"$f":"HLOOKUP(A66,'Courbe In'!$AA$2:$CD$7,4)","v":{"$error":"#VALUE!"}},{"$f":"HLOOKUP(A66,'Courbe In'!$AA$2:$CD$7,6)","v":{"$error":"#VALUE!"}},{"$f":"HLOOKUP(A66,'Courbe In'!$AA$2:$CD$8,7)","v":{"$error":"#VALUE!"}},{"$f":"HLOOKUP(A66,'Courbe In'!$AA$2:$CD$9,8)","v":{"$error":"#VALUE!"}}]
["2021-03-23",null,{"$f":"HLOOKUP(A67,'Courbe In'!$AA$2:$CD$3,2)","v":{"$error":"#VALUE!"}},{"$f":"HLOOKUP(A67,'Courbe In'!$AA$2:$CD$7,5)","v":{"$error":"#VALUE!"}},{"$f":"HLOOKUP(A67,'Courbe In'!$AA$2:$CD$7,4)","v":{"$error":"#VALUE!"}},{"$f":"HLOOKUP(A67,'Courbe In'!$AA$2:$CD$7,6)","v":{"$error":"#VALUE!"}},{"$f":"HLOOKUP(A67,'Courbe In'!$AA$2:$CD$8,7)","v":{"$error":"#VALUE!"}},{"$f":"HLOOKUP(A67,'Courbe In'!$AA$2:$CD$9,8)","v":{"$error":"#VALUE!"}}]
[{"$f":"A67+1","v":"2021-03-24"},null,{"$f":"HLOOKUP(A68,'Courbe In'!$AA$2:$CD$3,2)","v":{"$error":"#VALUE!"}},{"$f":"HLOOKUP(A68,'Courbe In'!$AA$2:$CD$7,5)","v":{"$error":"#VALUE!"}},{"$f":"HLOOKUP(A68,'Courbe In'!$AA$2:$CD$7,4)","v":{"$error":"#VALUE!"}},{"$f":"HLOOKUP(A68,'Courbe In'!$AA$2:$CD$7,6)","v":{"$error":"#VALUE!"}},{"$f":"HLOOKUP(A68,'Courbe In'!$AA$2:$CD$8,7)","v":{"$error":"#VALUE!"}},{"$f":"HLOOKUP(A68,'Courbe In'!$AA$2:$CD$9,8)","v":{"$error":"#VALUE!"}}]
["2021-03-25",null,{"$f":"HLOOKUP(A69,'Courbe In'!$AA$2:$CD$3,2)","v":{"$error":"#VALUE!"}},{"$f":"HLOOKUP(A69,'Courbe In'!$AA$2:$CD$7,5)","v":{"$error":"#VALUE!"}},{"$f":"HLOOKUP(A69,'Courbe In'!$AA$2:$CD$7,4)","v":{"$error":"#VALUE!"}},{"$f":"HLOOKUP(A69,'Courbe In'!$AA$2:$CD$7,6)","v":{"$error":"#VALUE!"}},{"$f":"HLOOKUP(A69,'Courbe In'!$AA$2:$CD$8,7)","v":{"$error":"#VALUE!"}},{"$f":"HLOOKUP(A69,'Courbe In'!$AA$2:$CD$9,8)","v":{"$error":"#VALUE!"}}]
["2021-03-26",null,{"$f":"HLOOKUP(A70,'Courbe In'!$AA$2:$CD$3,2)","v":{"$error":"#VALUE!"}},{"$f":"HLOOKUP(A70,'Courbe In'!$AA$2:$CD$7,5)","v":{"$error":"#VALUE!"}},{"$f":"HLOOKUP(A70,'Courbe In'!$AA$2:$CD$7,4)","v":{"$error":"#VALUE!"}},{"$f":"HLOOKUP(A70,'Courbe In'!$AA$2:$CD$7,6)","v":{"$error":"#VALUE!"}},{"$f":"HLOOKUP(A70,'Courbe In'!$AA$2:$CD$8,7)","v":{"$error":"#VALUE!"}},{"$f":"HLOOKUP(A70,'Courbe In'!$AA$2:$CD$9,8)","v":{"$error":"#VALUE!"}}]
["2021-03-27",null,{"$f":"HLOOKUP(A71,'Courbe In'!$AA$2:$CD$3,2)","v":{"$error":"#VALUE!"}},{"$f":"HLOOKUP(A71,'Courbe In'!$AA$2:$CD$7,5)","v":{"$error":"#VALUE!"}},{"$f":"HLOOKUP(A71,'Courbe In'!$AA$2:$CD$7,4)","v":{"$error":"#VALUE!"}},{"$f":"HLOOKUP(A71,'Courbe In'!$AA$2:$CD$7,6)","v":{"$error":"#VALUE!"}},{"$f":"HLOOKUP(A71,'Courbe In'!$AA$2:$CD$8,7)","v":{"$error":"#VALUE!"}},{"$f":"HLOOKUP(A71,'Courbe In'!$AA$2:$CD$9,8)","v":{"$error":"#VALUE!"}}]
["2021-03-28",null,{"$f":"HLOOKUP(A72,'Courbe In'!$AA$2:$CD$3,2)","v":{"$error":"#VALUE!"}},{"$f":"HLOOKUP(A72,'Courbe In'!$AA$2:$CD$7,5)","v":{"$error":"#VALUE!"}},{"$f":"HLOOKUP(A72,'Courbe In'!$AA$2:$CD$7,4)","v":{"$error":"#VALUE!"}},{"$f":"HLOOKUP(A72,'Courbe In'!$AA$2:$CD$7,6)","v":{"$error":"#VALUE!"}},{"$f":"HLOOKUP(A72,'Courbe In'!$AA$2:$CD$8,7)","v":{"$error":"#VALUE!"}},{"$f":"HLOOKUP(A72,'Courbe In'!$AA$2:$CD$9,8)","v":{"$error":"#VALUE!"}}]
["2021-03-29",null,{"$f":"HLOOKUP(A73,'Courbe In'!$AA$2:$CD$3,2)","v":{"$error":"#VALUE!"}},{"$f":"HLOOKUP(A73,'Courbe In'!$AA$2:$CD$7,5)","v":{"$error":"#VALUE!"}},{"$f":"HLOOKUP(A73,'Courbe In'!$AA$2:$CD$7,4)","v":{"$error":"#VALUE!"}},{"$f":"HLOOKUP(A73,'Courbe In'!$AA$2:$CD$7,6)","v":{"$error":"#VALUE!"}},{"$f":"HLOOKUP(A73,'Courbe In'!$AA$2:$CD$8,7)","v":{"$error":"#VALUE!"}},{"$f":"HLOOKUP(A73,'Courbe In'!$AA$2:$CD$9,8)","v":{"$error":"#VALUE!"}}]
["2021-03-30",null,{"$f":"HLOOKUP(A74,'Courbe In'!$AA$2:$CD$3,2)","v":{"$error":"#VALUE!"}},{"$f":"HLOOKUP(A74,'Courbe In'!$AA$2:$CD$7,5)","v":{"$error":"#VALUE!"}},{"$f":"HLOOKUP(A74,'Courbe In'!$AA$2:$CD$7,4)","v":{"$error":"#VALUE!"}},{"$f":"HLOOKUP(A74,'Courbe In'!$AA$2:$CD$7,6)","v":{"$error":"#VALUE!"}},{"$f":"HLOOKUP(A74,'Courbe In'!$AA$2:$CD$8,7)","v":{"$error":"#VALUE!"}},{"$f":"HLOOKUP(A74,'Courbe In'!$AA$2:$CD$9,8)","v":{"$error":"#VALUE!"}}]
["2021-03-31",null,{"$f":"HLOOKUP(A75,'Courbe In'!$AA$2:$CD$3,2)","v":{"$error":"#VALUE!"}},{"$f":"HLOOKUP(A75,'Courbe In'!$AA$2:$CD$7,5)","v":{"$error":"#VALUE!"}},{"$f":"HLOOKUP(A75,'Courbe In'!$AA$2:$CD$7,4)","v":{"$error":"#VALUE!"}},{"$f":"HLOOKUP(A75,'Courbe In'!$AA$2:$CD$7,6)","v":{"$error":"#VALUE!"}},{"$f":"HLOOKUP(A75,'Courbe In'!$AA$2:$CD$8,7)","v":{"$error":"#VALUE!"}},{"$f":"HLOOKUP(A75,'Courbe In'!$AA$2:$CD$9,8)","v":{"$error":"#VALUE!"}}]
["2021-04-01",null,{"$f":"HLOOKUP(A76,'Courbe In'!$AA$2:$CD$3,2)","v":{"$error":"#VALUE!"}},{"$f":"HLOOKUP(A76,'Courbe In'!$AA$2:$CD$7,5)","v":{"$error":"#VALUE!"}},{"$f":"HLOOKUP(A76,'Courbe In'!$AA$2:$CD$7,4)","v":{"$error":"#VALUE!"}},{"$f":"HLOOKUP(A76,'Courbe In'!$AA$2:$CD$7,6)","v":{"$error":"#VALUE!"}},{"$f":"HLOOKUP(A76,'Courbe In'!$AA$2:$CD$8,7)","v":{"$error":"#VALUE!"}},{"$f":"HLOOKUP(A76,'Courbe In'!$AA$2:$CD$9,8)","v":{"$error":"#VALUE!"}}]
["2021-04-02",null,{"$f":"HLOOKUP(A77,'Courbe In'!$AA$2:$CD$3,2)","v":{"$error":"#VALUE!"}},{"$f":"HLOOKUP(A77,'Courbe In'!$AA$2:$CD$7,5)","v":{"$error":"#VALUE!"}},{"$f":"HLOOKUP(A77,'Courbe In'!$AA$2:$CD$7,4)","v":{"$error":"#VALUE!"}},{"$f":"HLOOKUP(A77,'Courbe In'!$AA$2:$CD$7,6)","v":{"$error":"#VALUE!"}},{"$f":"HLOOKUP(A77,'Courbe In'!$AA$2:$CD$8,7)","v":{"$error":"#VALUE!"}},{"$f":"HLOOKUP(A77,'Courbe In'!$AA$2:$CD$9,8)","v":{"$error":"#VALUE!"}}]
["2021-04-03",null,{"$f":"HLOOKUP(A78,'Courbe In'!$AA$2:$CD$3,2)","v":{"$error":"#VALUE!"}},{"$f":"HLOOKUP(A78,'Courbe In'!$AA$2:$CD$7,5)","v":{"$error":"#VALUE!"}},{"$f":"HLOOKUP(A78,'Courbe In'!$AA$2:$CD$7,4)","v":{"$error":"#VALUE!"}},{"$f":"HLOOKUP(A78,'Courbe In'!$AA$2:$CD$7,6)","v":{"$error":"#VALUE!"}},{"$f":"HLOOKUP(A78,'Courbe In'!$AA$2:$CD$8,7)","v":{"$error":"#VALUE!"}},{"$f":"HLOOKUP(A78,'Courbe In'!$AA$2:$CD$9,8)","v":{"$error":"#VALUE!"}}]
["2021-04-04",null,{"$f":"HLOOKUP(A79,'Courbe In'!$AA$2:$CD$3,2)","v":{"$error":"#VALUE!"}},{"$f":"HLOOKUP(A79,'Courbe In'!$AA$2:$CD$7,5)","v":{"$error":"#VALUE!"}},{"$f":"HLOOKUP(A79,'Courbe In'!$AA$2:$CD$7,4)","v":{"$error":"#VALUE!"}},{"$f":"HLOOKUP(A79,'Courbe In'!$AA$2:$CD$7,6)","v":{"$error":"#VALUE!"}},{"$f":"HLOOKUP(A79,'Courbe In'!$AA$2:$CD$8,7)","v":{"$error":"#VALUE!"}},{"$f":"HLOOKUP(A79,'Courbe In'!$AA$2:$CD$9,8)","v":{"$error":"#VALUE!"}}]
["2021-04-05",null,{"$f":"HLOOKUP(A80,'Courbe In'!$AA$2:$CD$3,2)","v":{"$error":"#VALUE!"}},{"$f":"HLOOKUP(A80,'Courbe In'!$AA$2:$CD$7,5)","v":{"$error":"#VALUE!"}},{"$f":"HLOOKUP(A80,'Courbe In'!$AA$2:$CD$7,4)","v":{"$error":"#VALUE!"}},{"$f":"HLOOKUP(A80,'Courbe In'!$AA$2:$CD$7,6)","v":{"$error":"#VALUE!"}},{"$f":"HLOOKUP(A80,'Courbe In'!$AA$2:$CD$8,7)","v":{"$error":"#VALUE!"}},{"$f":"HLOOKUP(A80,'Courbe In'!$AA$2:$CD$9,8)","v":{"$error":"#VALUE!"}}]
["2021-04-06",null,{"$f":"HLOOKUP(A81,'Courbe In'!$AA$2:$CD$3,2)","v":{"$error":"#VALUE!"}},{"$f":"HLOOKUP(A81,'Courbe In'!$AA$2:$CD$7,5)","v":{"$error":"#VALUE!"}},{"$f":"HLOOKUP(A81,'Courbe In'!$AA$2:$CD$7,4)","v":{"$error":"#VALUE!"}},{"$f":"HLOOKUP(A81,'Courbe In'!$AA$2:$CD$7,6)","v":{"$error":"#VALUE!"}},{"$f":"HLOOKUP(A81,'Courbe In'!$AA$2:$CD$8,7)","v":{"$error":"#VALUE!"}},{"$f":"HLOOKUP(A81,'Courbe In'!$AA$2:$CD$9,8)","v":{"$error":"#VALUE!"}}]
["2021-04-07",null,{"$f":"HLOOKUP(A82,'Courbe In'!$AA$2:$CD$3,2)","v":{"$error":"#VALUE!"}},{"$f":"HLOOKUP(A82,'Courbe In'!$AA$2:$CD$7,5)","v":{"$error":"#VALUE!"}},{"$f":"HLOOKUP(A82,'Courbe In'!$AA$2:$CD$7,4)","v":{"$error":"#VALUE!"}},{"$f":"HLOOKUP(A82,'Courbe In'!$AA$2:$CD$7,6)","v":{"$error":"#VALUE!"}},{"$f":"HLOOKUP(A82,'Courbe In'!$AA$2:$CD$8,7)","v":{"$error":"#VALUE!"}},{"$f":"HLOOKUP(A82,'Courbe In'!$AA$2:$CD$9,8)","v":{"$error":"#VALUE!"}}]
["2021-04-08",null,{"$f":"HLOOKUP(A83,'Courbe In'!$AA$2:$CD$3,2)","v":{"$error":"#VALUE!"}},{"$f":"HLOOKUP(A83,'Courbe In'!$AA$2:$CD$7,5)","v":{"$error":"#VALUE!"}},{"$f":"HLOOKUP(A83,'Courbe In'!$AA$2:$CD$7,4)","v":{"$error":"#VALUE!"}},{"$f":"HLOOKUP(A83,'Courbe In'!$AA$2:$CD$7,6)","v":{"$error":"#VALUE!"}},{"$f":"HLOOKUP(A83,'Courbe In'!$AA$2:$CD$8,7)","v":{"$error":"#VALUE!"}},{"$f":"HLOOKUP(A83,'Courbe In'!$AA$2:$CD$9,8)","v":{"$error":"#VALUE!"}}]
["2021-04-09",null,{"$f":"HLOOKUP(A84,'Courbe In'!$AA$2:$CD$3,2)","v":{"$error":"#VALUE!"}},{"$f":"HLOOKUP(A84,'Courbe In'!$AA$2:$CD$7,5)","v":{"$error":"#VALUE!"}},{"$f":"HLOOKUP(A84,'Courbe In'!$AA$2:$CD$7,4)","v":{"$error":"#VALUE!"}},{"$f":"HLOOKUP(A84,'Courbe In'!$AA$2:$CD$7,6)","v":{"$error":"#VALUE!"}},{"$f":"HLOOKUP(A84,'Courbe In'!$AA$2:$CD$8,7)","v":{"$error":"#VALUE!"}},{"$f":"HLOOKUP(A84,'Courbe In'!$AA$2:$CD$9,8)","v":{"$error":"#VALUE!"}}]
["2021-04-10",null,{"$f":"HLOOKUP(A85,'Courbe In'!$AA$2:$CD$3,2)","v":{"$error":"#VALUE!"}},{"$f":"HLOOKUP(A85,'Courbe In'!$AA$2:$CD$7,5)","v":{"$error":"#VALUE!"}},{"$f":"HLOOKUP(A85,'Courbe In'!$AA$2:$CD$7,4)","v":{"$error":"#VALUE!"}},{"$f":"HLOOKUP(A85,'Courbe In'!$AA$2:$CD$7,6)","v":{"$error":"#VALUE!"}},{"$f":"HLOOKUP(A85,'Courbe In'!$AA$2:$CD$8,7)","v":{"$error":"#VALUE!"}},{"$f":"HLOOKUP(A85,'Courbe In'!$AA$2:$CD$9,8)","v":{"$error":"#VALUE!"}}]
["2021-04-11",null,{"$f":"HLOOKUP(A86,'Courbe In'!$AA$2:$CD$3,2)","v":{"$error":"#VALUE!"}},{"$f":"HLOOKUP(A86,'Courbe In'!$AA$2:$CD$7,5)","v":{"$error":"#VALUE!"}},{"$f":"HLOOKUP(A86,'Courbe In'!$AA$2:$CD$7,4)","v":{"$error":"#VALUE!"}},{"$f":"HLOOKUP(A86,'Courbe In'!$AA$2:$CD$7,6)","v":{"$error":"#VALUE!"}},{"$f":"HLOOKUP(A86,'Courbe In'!$AA$2:$CD$8,7)","v":{"$error":"#VALUE!"}},{"$f":"HLOOKUP(A86,'Courbe In'!$AA$2:$CD$9,8)","v":{"$error":"#VALUE!"}}]
["2021-04-12",null,{"$f":"HLOOKUP(A87,'Courbe In'!$AA$2:$CD$3,2)","v":{"$error":"#VALUE!"}},{"$f":"HLOOKUP(A87,'Courbe In'!$AA$2:$CD$7,5)","v":{"$error":"#VALUE!"}},{"$f":"HLOOKUP(A87,'Courbe In'!$AA$2:$CD$7,4)","v":{"$error":"#VALUE!"}},{"$f":"HLOOKUP(A87,'Courbe In'!$AA$2:$CD$7,6)","v":{"$error":"#VALUE!"}},{"$f":"HLOOKUP(A87,'Courbe In'!$AA$2:$CD$8,7)","v":{"$error":"#VALUE!"}},{"$f":"HLOOKUP(A87,'Courbe In'!$AA$2:$CD$9,8)","v":{"$error":"#VALUE!"}}]
["2021-04-13",null,{"$f":"HLOOKUP(A88,'Courbe In'!$AA$2:$CD$3,2)","v":{"$error":"#VALUE!"}},{"$f":"HLOOKUP(A88,'Courbe In'!$AA$2:$CD$7,5)","v":{"$error":"#VALUE!"}},{"$f":"HLOOKUP(A88,'Courbe In'!$AA$2:$CD$7,4)","v":{"$error":"#VALUE!"}},{"$f":"HLOOKUP(A88,'Courbe In'!$AA$2:$CD$7,6)","v":{"$error":"#VALUE!"}},{"$f":"HLOOKUP(A88,'Courbe In'!$AA$2:$CD$8,7)","v":{"$error":"#VALUE!"}},{"$f":"HLOOKUP(A88,'Courbe In'!$AA$2:$CD$9,8)","v":{"$error":"#VALUE!"}}]
["2021-04-14",null,{"$f":"HLOOKUP(A89,'Courbe In'!$AA$2:$CD$3,2)","v":{"$error":"#VALUE!"}},{"$f":"HLOOKUP(A89,'Courbe In'!$AA$2:$CD$7,5)","v":{"$error":"#VALUE!"}},{"$f":"HLOOKUP(A89,'Courbe In'!$AA$2:$CD$7,4)","v":{"$error":"#VALUE!"}},{"$f":"HLOOKUP(A89,'Courbe In'!$AA$2:$CD$7,6)","v":{"$error":"#VALUE!"}},{"$f":"HLOOKUP(A89,'Courbe In'!$AA$2:$CD$8,7)","v":{"$error":"#VALUE!"}},{"$f":"HLOOKUP(A89,'Courbe In'!$AA$2:$CD$9,8)","v":{"$error":"#VALUE!"}}]
["2021-04-15",null,{"$f":"HLOOKUP(A90,'Courbe In'!$AA$2:$CD$3,2)","v":{"$error":"#VALUE!"}},{"$f":"HLOOKUP(A90,'Courbe In'!$AA$2:$CD$7,5)","v":{"$error":"#VALUE!"}},{"$f":"HLOOKUP(A90,'Courbe In'!$AA$2:$CD$7,4)","v":{"$error":"#VALUE!"}},{"$f":"HLOOKUP(A90,'Courbe In'!$AA$2:$CD$7,6)","v":{"$error":"#VALUE!"}},{"$f":"HLOOKUP(A90,'Courbe In'!$AA$2:$CD$8,7)","v":{"$error":"#VALUE!"}},{"$f":"HLOOKUP(A90,'Courbe In'!$AA$2:$CD$9,8)","v":{"$error":"#VALUE!"}}]
["2021-04-16",null,{"$f":"HLOOKUP(A91,'Courbe In'!$AA$2:$CD$3,2)","v":{"$error":"#VALUE!"}},{"$f":"HLOOKUP(A91,'Courbe In'!$AA$2:$CD$7,5)","v":{"$error":"#VALUE!"}},{"$f":"HLOOKUP(A91,'Courbe In'!$AA$2:$CD$7,4)","v":{"$error":"#VALUE!"}},{"$f":"HLOOKUP(A91,'Courbe In'!$AA$2:$CD$7,6)","v":{"$error":"#VALUE!"}},{"$f":"HLOOKUP(A91,'Courbe In'!$AA$2:$CD$8,7)","v":{"$error":"#VALUE!"}},{"$f":"HLOOKUP(A91,'Courbe In'!$AA$2:$CD$9,8)","v":{"$error":"#VALUE!"}}]
["2021-04-17",null,{"$f":"HLOOKUP(A92,'Courbe In'!$AA$2:$CD$3,2)","v":{"$error":"#VALUE!"}},{"$f":"HLOOKUP(A92,'Courbe In'!$AA$2:$CD$7,5)","v":{"$error":"#VALUE!"}},{"$f":"HLOOKUP(A92,'Courbe In'!$AA$2:$CD$7,4)","v":{"$error":"#VALUE!"}},{"$f":"HLOOKUP(A92,'Courbe In'!$AA$2:$CD$7,6)","v":{"$error":"#VALUE!"}},{"$f":"HLOOKUP(A92,'Courbe In'!$AA$2:$CD$8,7)","v":{"$error":"#VALUE!"}},{"$f":"HLOOKUP(A92,'Courbe In'!$AA$2:$CD$9,8)","v":{"$error":"#VALUE!"}}]
["2021-04-18",null,{"$f":"HLOOKUP(A93,'Courbe In'!$AA$2:$CD$3,2)","v":{"$error":"#VALUE!"}},{"$f":"HLOOKUP(A93,'Courbe In'!$AA$2:$CD$7,5)","v":{"$error":"#VALUE!"}},{"$f":"HLOOKUP(A93,'Courbe In'!$AA$2:$CD$7,4)","v":{"$error":"#VALUE!"}},{"$f":"HLOOKUP(A93,'Courbe In'!$AA$2:$CD$7,6)","v":{"$error":"#VALUE!"}},{"$f":"HLOOKUP(A93,'Courbe In'!$AA$2:$CD$8,7)","v":{"$error":"#VALUE!"}},{"$f":"HLOOKUP(A93,'Courbe In'!$AA$2:$CD$9,8)","v":{"$error":"#VALUE!"}}]
["2021-04-19",null,{"$f":"HLOOKUP(A94,'Courbe In'!$AA$2:$CD$3,2)","v":{"$error":"#VALUE!"}},{"$f":"HLOOKUP(A94,'Courbe In'!$AA$2:$CD$7,5)","v":{"$error":"#VALUE!"}},{"$f":"HLOOKUP(A94,'Courbe In'!$AA$2:$CD$7,4)","v":{"$error":"#VALUE!"}},{"$f":"HLOOKUP(A94,'Courbe In'!$AA$2:$CD$7,6)","v":{"$error":"#VALUE!"}},{"$f":"HLOOKUP(A94,'Courbe In'!$AA$2:$CD$8,7)","v":{"$error":"#VALUE!"}},{"$f":"HLOOKUP(A94,'Courbe In'!$AA$2:$CD$9,8)","v":{"$error":"#VALUE!"}}]
["2021-04-20",null,{"$f":"HLOOKUP(A95,'Courbe In'!$AA$2:$CD$3,2)","v":{"$error":"#VALUE!"}},{"$f":"HLOOKUP(A95,'Courbe In'!$AA$2:$CD$7,5)","v":{"$error":"#VALUE!"}},{"$f":"HLOOKUP(A95,'Courbe In'!$AA$2:$CD$7,4)","v":{"$error":"#VALUE!"}},{"$f":"HLOOKUP(A95,'Courbe In'!$AA$2:$CD$7,6)","v":{"$error":"#VALUE!"}},{"$f":"HLOOKUP(A95,'Courbe In'!$AA$2:$CD$8,7)","v":{"$error":"#VALUE!"}},{"$f":"HLOOKUP(A95,'Courbe In'!$AA$2:$CD$9,8)","v":{"$error":"#VALUE!"}}]
["2021-04-21",null,{"$f":"HLOOKUP(A96,'Courbe In'!$AA$2:$CD$3,2)","v":{"$error":"#VALUE!"}},{"$f":"HLOOKUP(A96,'Courbe In'!$AA$2:$CD$7,5)","v":{"$error":"#VALUE!"}},{"$f":"HLOOKUP(A96,'Courbe In'!$AA$2:$CD$7,4)","v":{"$error":"#VALUE!"}},{"$f":"HLOOKUP(A96,'Courbe In'!$AA$2:$CD$7,6)","v":{"$error":"#VALUE!"}},{"$f":"HLOOKUP(A96,'Courbe In'!$AA$2:$CD$8,7)","v":{"$error":"#VALUE!"}},{"$f":"HLOOKUP(A96,'Courbe In'!$AA$2:$CD$9,8)","v":{"$error":"#VALUE!"}}]
["2021-04-22",null,{"$f":"HLOOKUP(A97,'Courbe In'!$AA$2:$CD$3,2)","v":{"$error":"#VALUE!"}},{"$f":"HLOOKUP(A97,'Courbe In'!$AA$2:$CD$7,5)","v":{"$error":"#VALUE!"}},{"$f":"HLOOKUP(A97,'Courbe In'!$AA$2:$CD$7,4)","v":{"$error":"#VALUE!"}},{"$f":"HLOOKUP(A97,'Courbe In'!$AA$2:$CD$7,6)","v":{"$error":"#VALUE!"}},{"$f":"HLOOKUP(A97,'Courbe In'!$AA$2:$CD$8,7)","v":{"$error":"#VALUE!"}},{"$f":"HLOOKUP(A97,'Courbe In'!$AA$2:$CD$9,8)","v":{"$error":"#VALUE!"}}]
["2021-04-23",null,{"$f":"HLOOKUP(A98,'Courbe In'!$AA$2:$CD$3,2)","v":{"$error":"#VALUE!"}},{"$f":"HLOOKUP(A98,'Courbe In'!$AA$2:$CD$7,5)","v":{"$error":"#VALUE!"}},{"$f":"HLOOKUP(A98,'Courbe In'!$AA$2:$CD$7,4)","v":{"$error":"#VALUE!"}},{"$f":"HLOOKUP(A98,'Courbe In'!$AA$2:$CD$7,6)","v":{"$error":"#VALUE!"}},{"$f":"HLOOKUP(A98,'Courbe In'!$AA$2:$CD$8,7)","v":{"$error":"#VALUE!"}},{"$f":"HLOOKUP(A98,'Courbe In'!$AA$2:$CD$9,8)","v":{"$error":"#VALUE!"}}]
["2021-04-24",null,{"$f":"HLOOKUP(A99,'Courbe In'!$AA$2:$CD$3,2)","v":{"$error":"#VALUE!"}},{"$f":"HLOOKUP(A99,'Courbe In'!$AA$2:$CD$7,5)","v":{"$error":"#VALUE!"}},{"$f":"HLOOKUP(A99,'Courbe In'!$AA$2:$CD$7,4)","v":{"$error":"#VALUE!"}},{"$f":"HLOOKUP(A99,'Courbe In'!$AA$2:$CD$7,6)","v":{"$error":"#VALUE!"}},{"$f":"HLOOKUP(A99,'Courbe In'!$AA$2:$CD$8,7)","v":{"$error":"#VALUE!"}},{"$f":"HLOOKUP(A99,'Courbe In'!$AA$2:$CD$9,8)","v":{"$error":"#VALUE!"}}]
["2021-04-25",null,{"$f":"HLOOKUP(A100,'Courbe In'!$AA$2:$CD$3,2)","v":{"$error":"#VALUE!"}},{"$f":"HLOOKUP(A100,'Courbe In'!$AA$2:$CD$7,5)","v":{"$error":"#VALUE!"}},{"$f":"HLOOKUP(A100,'Courbe In'!$AA$2:$CD$7,4)","v":{"$error":"#VALUE!"}},{"$f":"HLOOKUP(A100,'Courbe In'!$AA$2:$CD$7,6)","v":{"$error":"#VALUE!"}},{"$f":"HLOOKUP(A100,'Courbe In'!$AA$2:$CD$8,7)","v":{"$error":"#VALUE!"}},{"$f":"HLOOKUP(A100,'Courbe In'!$AA$2:$CD$9,8)","v":{"$error":"#VALUE!"}}]
["2021-04-26",null,{"$f":"HLOOKUP(A101,'Courbe In'!$AA$2:$CD$3,2)","v":{"$error":"#VALUE!"}},{"$f":"HLOOKUP(A101,'Courbe In'!$AA$2:$CD$7,5)","v":{"$error":"#VALUE!"}},{"$f":"HLOOKUP(A101,'Courbe In'!$AA$2:$CD$7,4)","v":{"$error":"#VALUE!"}},{"$f":"HLOOKUP(A101,'Courbe In'!$AA$2:$CD$7,6)","v":{"$error":"#VALUE!"}},{"$f":"HLOOKUP(A101,'Courbe In'!$AA$2:$CD$8,7)","v":{"$error":"#VALUE!"}},{"$f":"HLOOKUP(A101,'Courbe In'!$AA$2:$CD$9,8)","v":{"$error":"#VALUE!"}}]
["2021-04-27",null,{"$f":"HLOOKUP(A102,'Courbe In'!$AA$2:$CD$3,2)","v":{"$error":"#VALUE!"}},{"$f":"HLOOKUP(A102,'Courbe In'!$AA$2:$CD$7,5)","v":{"$error":"#VALUE!"}},{"$f":"HLOOKUP(A102,'Courbe In'!$AA$2:$CD$7,4)","v":{"$error":"#VALUE!"}},{"$f":"HLOOKUP(A102,'Courbe In'!$AA$2:$CD$7,6)","v":{"$error":"#VALUE!"}},{"$f":"HLOOKUP(A102,'Courbe In'!$AA$2:$CD$8,7)","v":{"$error":"#VALUE!"}},{"$f":"HLOOKUP(A102,'Courbe In'!$AA$2:$CD$9,8)","v":{"$error":"#VALUE!"}}]
["2021-04-28",null,{"$f":"HLOOKUP(A103,'Courbe In'!$AA$2:$CD$3,2)","v":{"$error":"#VALUE!"}},{"$f":"HLOOKUP(A103,'Courbe In'!$AA$2:$CD$7,5)","v":{"$error":"#VALUE!"}},{"$f":"HLOOKUP(A103,'Courbe In'!$AA$2:$CD$7,4)","v":{"$error":"#VALUE!"}},{"$f":"HLOOKUP(A103,'Courbe In'!$AA$2:$CD$7,6)","v":{"$error":"#VALUE!"}},{"$f":"HLOOKUP(A103,'Courbe In'!$AA$2:$CD$8,7)","v":{"$error":"#VALUE!"}},{"$f":"HLOOKUP(A103,'Courbe In'!$AA$2:$CD$9,8)","v":{"$error":"#VALUE!"}}]
["2021-04-29",null,{"$f":"HLOOKUP(A104,'Courbe In'!$AA$2:$CD$3,2)","v":{"$error":"#VALUE!"}},{"$f":"HLOOKUP(A104,'Courbe In'!$AA$2:$CD$7,5)","v":{"$error":"#VALUE!"}},{"$f":"HLOOKUP(A104,'Courbe In'!$AA$2:$CD$7,4)","v":{"$error":"#VALUE!"}},{"$f":"HLOOKUP(A104,'Courbe In'!$AA$2:$CD$7,6)","v":{"$error":"#VALUE!"}},{"$f":"HLOOKUP(A104,'Courbe In'!$AA$2:$CD$8,7)","v":{"$error":"#VALUE!"}},{"$f":"HLOOKUP(A104,'Courbe In'!$AA$2:$CD$9,8)","v":{"$error":"#VALUE!"}}]
["2021-04-30",null,{"$f":"HLOOKUP(A105,'Courbe In'!$AA$2:$CD$3,2)","v":{"$error":"#VALUE!"}},{"$f":"HLOOKUP(A105,'Courbe In'!$AA$2:$CD$7,5)","v":{"$error":"#VALUE!"}},{"$f":"HLOOKUP(A105,'Courbe In'!$AA$2:$CD$7,4)","v":{"$error":"#VALUE!"}},{"$f":"HLOOKUP(A105,'Courbe In'!$AA$2:$CD$7,6)","v":{"$error":"#VALUE!"}},{"$f":"HLOOKUP(A105,'Courbe In'!$AA$2:$CD$8,7)","v":{"$error":"#VALUE!"}},{"$f":"HLOOKUP(A105,'Courbe In'!$AA$2:$CD$9,8)","v":{"$error":"#VALUE!"}}]
["2021-05-01",null,{"$f":"HLOOKUP(A106,'Courbe In'!$AA$2:$CD$3,2)","v":{"$error":"#VALUE!"}},{"$f":"HLOOKUP(A106,'Courbe In'!$AA$2:$CD$7,5)","v":{"$error":"#VALUE!"}},{"$f":"HLOOKUP(A106,'Courbe In'!$AA$2:$CD$7,4)","v":{"$error":"#VALUE!"}},{"$f":"HLOOKUP(A106,'Courbe In'!$AA$2:$CD$7,6)","v":{"$error":"#VALUE!"}},{"$f":"HLOOKUP(A106,'Courbe In'!$AA$2:$CD$8,7)","v":{"$error":"#VALUE!"}},{"$f":"HLOOKUP(A106,'Courbe In'!$AA$2:$CD$9,8)","v":{"$error":"#VALUE!"}}]
["2021-05-02",null,{"$f":"HLOOKUP(A107,'Courbe In'!$AA$2:$CD$3,2)","v":{"$error":"#VALUE!"}},{"$f":"HLOOKUP(A107,'Courbe In'!$AA$2:$CD$7,5)","v":{"$error":"#VALUE!"}},{"$f":"HLOOKUP(A107,'Courbe In'!$AA$2:$CD$7,4)","v":{"$error":"#VALUE!"}},{"$f":"HLOOKUP(A107,'Courbe In'!$AA$2:$CD$7,6)","v":{"$error":"#VALUE!"}},{"$f":"HLOOKUP(A107,'Courbe In'!$AA$2:$CD$8,7)","v":{"$error":"#VALUE!"}},{"$f":"HLOOKUP(A107,'Courbe In'!$AA$2:$CD$9,8)","v":{"$error":"#VALUE!"}}]
["2021-05-03",null,{"$f":"HLOOKUP(A108,'Courbe In'!$AA$2:$CD$3,2)","v":{"$error":"#VALUE!"}},{"$f":"HLOOKUP(A108,'Courbe In'!$AA$2:$CD$7,5)","v":{"$error":"#VALUE!"}},{"$f":"HLOOKUP(A108,'Courbe In'!$AA$2:$CD$7,4)","v":{"$error":"#VALUE!"}},{"$f":"HLOOKUP(A108,'Courbe In'!$AA$2:$CD$7,6)","v":{"$error":"#VALUE!"}},{"$f":"HLOOKUP(A108,'Courbe In'!$AA$2:$CD$8,7)","v":{"$error":"#VALUE!"}},{"$f":"HLOOKUP(A108,'Courbe In'!$AA$2:$CD$9,8)","v":{"$error":"#VALUE!"}}]
["2021-05-04",null,{"$f":"HLOOKUP(A109,'Courbe In'!$AA$2:$CD$3,2)","v":{"$error":"#VALUE!"}},{"$f":"HLOOKUP(A109,'Courbe In'!$AA$2:$CD$7,5)","v":{"$error":"#VALUE!"}},{"$f":"HLOOKUP(A109,'Courbe In'!$AA$2:$CD$7,4)","v":{"$error":"#VALUE!"}},{"$f":"HLOOKUP(A109,'Courbe In'!$AA$2:$CD$7,6)","v":{"$error":"#VALUE!"}},{"$f":"HLOOKUP(A109,'Courbe In'!$AA$2:$CD$8,7)","v":{"$error":"#VALUE!"}},{"$f":"HLOOKUP(A109,'Courbe In'!$AA$2:$CD$9,8)","v":{"$error":"#VALUE!"}}]
["2021-05-05",null,{"$f":"HLOOKUP(A110,'Courbe In'!$AA$2:$CD$3,2)","v":{"$error":"#VALUE!"}},{"$f":"HLOOKUP(A110,'Courbe In'!$AA$2:$CD$7,5)","v":{"$error":"#VALUE!"}},{"$f":"HLOOKUP(A110,'Courbe In'!$AA$2:$CD$7,4)","v":{"$error":"#VALUE!"}},{"$f":"HLOOKUP(A110,'Courbe In'!$AA$2:$CD$7,6)","v":{"$error":"#VALUE!"}},{"$f":"HLOOKUP(A110,'Courbe In'!$AA$2:$CD$8,7)","v":{"$error":"#VALUE!"}},{"$f":"HLOOKUP(A110,'Courbe In'!$AA$2:$CD$9,8)","v":{"$error":"#VALUE!"}}]
["2021-05-06",null,{"$f":"HLOOKUP(A111,'Courbe In'!$AA$2:$CD$3,2)","v":{"$error":"#VALUE!"}},{"$f":"HLOOKUP(A111,'Courbe In'!$AA$2:$CD$7,5)","v":{"$error":"#VALUE!"}},{"$f":"HLOOKUP(A111,'Courbe In'!$AA$2:$CD$7,4)","v":{"$error":"#VALUE!"}},{"$f":"HLOOKUP(A111,'Courbe In'!$AA$2:$CD$7,6)","v":{"$error":"#VALUE!"}},{"$f":"HLOOKUP(A111,'Courbe In'!$AA$2:$CD$8,7)","v":{"$error":"#VALUE!"}},{"$f":"HLOOKUP(A111,'Courbe In'!$AA$2:$CD$9,8)","v":{"$error":"#VALUE!"}}]
["2021-05-07",null,{"$f":"HLOOKUP(A112,'Courbe In'!$AA$2:$CD$3,2)","v":{"$error":"#VALUE!"}},{"$f":"HLOOKUP(A112,'Courbe In'!$AA$2:$CD$7,5)","v":{"$error":"#VALUE!"}},{"$f":"HLOOKUP(A112,'Courbe In'!$AA$2:$CD$7,4)","v":{"$error":"#VALUE!"}},{"$f":"HLOOKUP(A112,'Courbe In'!$AA$2:$CD$7,6)","v":{"$error":"#VALUE!"}},{"$f":"HLOOKUP(A112,'Courbe In'!$AA$2:$CD$8,7)","v":{"$error":"#VALUE!"}},{"$f":"HLOOKUP(A112,'Courbe In'!$AA$2:$CD$9,8)","v":{"$error":"#VALUE!"}}]
["2021-05-08",null,{"$f":"HLOOKUP(A113,'Courbe In'!$AA$2:$CD$3,2)","v":{"$error":"#VALUE!"}},{"$f":"HLOOKUP(A113,'Courbe In'!$AA$2:$CD$7,5)","v":{"$error":"#VALUE!"}},{"$f":"HLOOKUP(A113,'Courbe In'!$AA$2:$CD$7,4)","v":{"$error":"#VALUE!"}},{"$f":"HLOOKUP(A113,'Courbe In'!$AA$2:$CD$7,6)","v":{"$error":"#VALUE!"}},{"$f":"HLOOKUP(A113,'Courbe In'!$AA$2:$CD$8,7)","v":{"$error":"#VALUE!"}},{"$f":"HLOOKUP(A113,'Courbe In'!$AA$2:$CD$9,8)","v":{"$error":"#VALUE!"}}]
["2021-05-09",null,{"$f":"HLOOKUP(A114,'Courbe In'!$AA$2:$CD$3,2)","v":{"$error":"#VALUE!"}},{"$f":"HLOOKUP(A114,'Courbe In'!$AA$2:$CD$7,5)","v":{"$error":"#VALUE!"}},{"$f":"HLOOKUP(A114,'Courbe In'!$AA$2:$CD$7,4)","v":{"$error":"#VALUE!"}},{"$f":"HLOOKUP(A114,'Courbe In'!$AA$2:$CD$7,6)","v":{"$error":"#VALUE!"}},{"$f":"HLOOKUP(A114,'Courbe In'!$AA$2:$CD$8,7)","v":{"$error":"#VALUE!"}},{"$f":"HLOOKUP(A114,'Courbe In'!$AA$2:$CD$9,8)","v":{"$error":"#VALUE!"}}]
["2021-05-10",null,{"$f":"HLOOKUP(A115,'Courbe In'!$AA$2:$CD$3,2)","v":{"$error":"#VALUE!"}},{"$f":"HLOOKUP(A115,'Courbe In'!$AA$2:$CD$7,5)","v":{"$error":"#VALUE!"}},{"$f":"HLOOKUP(A115,'Courbe In'!$AA$2:$CD$7,4)","v":{"$error":"#VALUE!"}},{"$f":"HLOOKUP(A115,'Courbe In'!$AA$2:$CD$7,6)","v":{"$error":"#VALUE!"}},{"$f":"HLOOKUP(A115,'Courbe In'!$AA$2:$CD$8,7)","v":{"$error":"#VALUE!"}},{"$f":"HLOOKUP(A115,'Courbe In'!$AA$2:$CD$9,8)","v":{"$error":"#VALUE!"}}]
["2021-05-11",null,{"$f":"HLOOKUP(A116,'Courbe In'!$AA$2:$CD$3,2)","v":{"$error":"#VALUE!"}},{"$f":"HLOOKUP(A116,'Courbe In'!$AA$2:$CD$7,5)","v":{"$error":"#VALUE!"}},{"$f":"HLOOKUP(A116,'Courbe In'!$AA$2:$CD$7,4)","v":{"$error":"#VALUE!"}},{"$f":"HLOOKUP(A116,'Courbe In'!$AA$2:$CD$7,6)","v":{"$error":"#VALUE!"}},{"$f":"HLOOKUP(A116,'Courbe In'!$AA$2:$CD$8,7)","v":{"$error":"#VALUE!"}},{"$f":"HLOOKUP(A116,'Courbe In'!$AA$2:$CD$9,8)","v":{"$error":"#VALUE!"}}]
["2021-05-12",null,{"$f":"HLOOKUP(A117,'Courbe In'!$AA$2:$CD$3,2)","v":{"$error":"#VALUE!"}},{"$f":"HLOOKUP(A117,'Courbe In'!$AA$2:$CD$7,5)","v":{"$error":"#VALUE!"}},{"$f":"HLOOKUP(A117,'Courbe In'!$AA$2:$CD$7,4)","v":{"$error":"#VALUE!"}},{"$f":"HLOOKUP(A117,'Courbe In'!$AA$2:$CD$7,6)","v":{"$error":"#VALUE!"}},{"$f":"HLOOKUP(A117,'Courbe In'!$AA$2:$CD$8,7)","v":{"$error":"#VALUE!"}},{"$f":"HLOOKUP(A117,'Courbe In'!$AA$2:$CD$9,8)","v":{"$error":"#VALUE!"}}]
["2021-05-13",null,{"$f":"HLOOKUP(A118,'Courbe In'!$AA$2:$CD$3,2)","v":{"$error":"#VALUE!"}},{"$f":"HLOOKUP(A118,'Courbe In'!$AA$2:$CD$7,5)","v":{"$error":"#VALUE!"}},{"$f":"HLOOKUP(A118,'Courbe In'!$AA$2:$CD$7,4)","v":{"$error":"#VALUE!"}},{"$f":"HLOOKUP(A118,'Courbe In'!$AA$2:$CD$7,6)","v":{"$error":"#VALUE!"}},{"$f":"HLOOKUP(A118,'Courbe In'!$AA$2:$CD$8,7)","v":{"$error":"#VALUE!"}},{"$f":"HLOOKUP(A118,'Courbe In'!$AA$2:$CD$9,8)","v":{"$error":"#VALUE!"}}]
["2021-05-14",null,{"$f":"HLOOKUP(A119,'Courbe In'!$AA$2:$CD$3,2)","v":{"$error":"#VALUE!"}},{"$f":"HLOOKUP(A119,'Courbe In'!$AA$2:$CD$7,5)","v":{"$error":"#VALUE!"}},{"$f":"HLOOKUP(A119,'Courbe In'!$AA$2:$CD$7,4)","v":{"$error":"#VALUE!"}},{"$f":"HLOOKUP(A119,'Courbe In'!$AA$2:$CD$7,6)","v":{"$error":"#VALUE!"}},{"$f":"HLOOKUP(A119,'Courbe In'!$AA$2:$CD$8,7)","v":{"$error":"#VALUE!"}},{"$f":"HLOOKUP(A119,'Courbe In'!$AA$2:$CD$9,8)","v":{"$error":"#VALUE!"}}]
["2021-05-15",null,{"$f":"HLOOKUP(A120,'Courbe In'!$AA$2:$CD$3,2)","v":{"$error":"#VALUE!"}},{"$f":"HLOOKUP(A120,'Courbe In'!$AA$2:$CD$7,5)","v":{"$error":"#VALUE!"}},{"$f":"HLOOKUP(A120,'Courbe In'!$AA$2:$CD$7,4)","v":{"$error":"#VALUE!"}},{"$f":"HLOOKUP(A120,'Courbe In'!$AA$2:$CD$7,6)","v":{"$error":"#VALUE!"}},{"$f":"HLOOKUP(A120,'Courbe In'!$AA$2:$CD$8,7)","v":{"$error":"#VALUE!"}},{"$f":"HLOOKUP(A120,'Courbe In'!$AA$2:$CD$9,8)","v":{"$error":"#VALUE!"}}]
["2021-05-16",null,{"$f":"HLOOKUP(A121,'Courbe In'!$AA$2:$CD$3,2)","v":{"$error":"#VALUE!"}},{"$f":"HLOOKUP(A121,'Courbe In'!$AA$2:$CD$7,5)","v":{"$error":"#VALUE!"}},{"$f":"HLOOKUP(A121,'Courbe In'!$AA$2:$CD$7,4)","v":{"$error":"#VALUE!"}},{"$f":"HLOOKUP(A121,'Courbe In'!$AA$2:$CD$7,6)","v":{"$error":"#VALUE!"}},{"$f":"HLOOKUP(A121,'Courbe In'!$AA$2:$CD$8,7)","v":{"$error":"#VALUE!"}},{"$f":"HLOOKUP(A121,'Courbe In'!$AA$2:$CD$9,8)","v":{"$error":"#VALUE!"}}]
["2021-05-17",null,{"$f":"HLOOKUP(A122,'Courbe In'!$AA$2:$CD$3,2)","v":{"$error":"#VALUE!"}},{"$f":"HLOOKUP(A122,'Courbe In'!$AA$2:$CD$7,5)","v":{"$error":"#VALUE!"}},{"$f":"HLOOKUP(A122,'Courbe In'!$AA$2:$CD$7,4)","v":{"$error":"#VALUE!"}},{"$f":"HLOOKUP(A122,'Courbe In'!$AA$2:$CD$7,6)","v":{"$error":"#VALUE!"}},{"$f":"HLOOKUP(A122,'Courbe In'!$AA$2:$CD$8,7)","v":{"$error":"#VALUE!"}},{"$f":"HLOOKUP(A122,'Courbe In'!$AA$2:$CD$9,8)","v":{"$error":"#VALUE!"}}]
["2021-05-18",null,{"$f":"HLOOKUP(A123,'Courbe In'!$AA$2:$CD$3,2)","v":{"$error":"#VALUE!"}},{"$f":"HLOOKUP(A123,'Courbe In'!$AA$2:$CD$7,5)","v":{"$error":"#VALUE!"}},{"$f":"HLOOKUP(A123,'Courbe In'!$AA$2:$CD$7,4)","v":{"$error":"#VALUE!"}},{"$f":"HLOOKUP(A123,'Courbe In'!$AA$2:$CD$7,6)","v":{"$error":"#VALUE!"}},{"$f":"HLOOKUP(A123,'Courbe In'!$AA$2:$CD$8,7)","v":{"$error":"#VALUE!"}},{"$f":"HLOOKUP(A123,'Courbe In'!$AA$2:$CD$9,8)","v":{"$error":"#VALUE!"}}]
["2021-05-19",null,{"$f":"HLOOKUP(A124,'Courbe In'!$AA$2:$CD$3,2)","v":{"$error":"#VALUE!"}},{"$f":"HLOOKUP(A124,'Courbe In'!$AA$2:$CD$7,5)","v":{"$error":"#VALUE!"}},{"$f":"HLOOKUP(A124,'Courbe In'!$AA$2:$CD$7,4)","v":{"$error":"#VALUE!"}},{"$f":"HLOOKUP(A124,'Courbe In'!$AA$2:$CD$7,6)","v":{"$error":"#VALUE!"}},{"$f":"HLOOKUP(A124,'Courbe In'!$AA$2:$CD$8,7)","v":{"$error":"#VALUE!"}},{"$f":"HLOOKUP(A124,'Courbe In'!$AA$2:$CD$9,8)","v":{"$error":"#VALUE!"}}]
["2021-05-20",null,{"$f":"HLOOKUP(A125,'Courbe In'!$AA$2:$CD$3,2)","v":{"$error":"#VALUE!"}},{"$f":"HLOOKUP(A125,'Courbe In'!$AA$2:$CD$7,5)","v":{"$error":"#VALUE!"}},{"$f":"HLOOKUP(A125,'Courbe In'!$AA$2:$CD$7,4)","v":{"$error":"#VALUE!"}},{"$f":"HLOOKUP(A125,'Courbe In'!$AA$2:$CD$7,6)","v":{"$error":"#VALUE!"}},{"$f":"HLOOKUP(A125,'Courbe In'!$AA$2:$CD$8,7)","v":{"$error":"#VALUE!"}},{"$f":"HLOOKUP(A125,'Courbe In'!$AA$2:$CD$9,8)","v":{"$error":"#VALUE!"}}]
["2021-05-21",null,{"$f":"HLOOKUP(A126,'Courbe In'!$AA$2:$CD$3,2)","v":{"$error":"#VALUE!"}},{"$f":"HLOOKUP(A126,'Courbe In'!$AA$2:$CD$7,5)","v":{"$error":"#VALUE!"}},{"$f":"HLOOKUP(A126,'Courbe In'!$AA$2:$CD$7,4)","v":{"$error":"#VALUE!"}},{"$f":"HLOOKUP(A126,'Courbe In'!$AA$2:$CD$7,6)","v":{"$error":"#VALUE!"}},{"$f":"HLOOKUP(A126,'Courbe In'!$AA$2:$CD$8,7)","v":{"$error":"#VALUE!"}},{"$f":"HLOOKUP(A126,'Courbe In'!$AA$2:$CD$9,8)","v":{"$error":"#VALUE!"}}]
["2021-05-22",null,{"$f":"HLOOKUP(A127,'Courbe In'!$AA$2:$CD$3,2)","v":{"$error":"#VALUE!"}},{"$f":"HLOOKUP(A127,'Courbe In'!$AA$2:$CD$7,5)","v":{"$error":"#VALUE!"}},{"$f":"HLOOKUP(A127,'Courbe In'!$AA$2:$CD$7,4)","v":{"$error":"#VALUE!"}},{"$f":"HLOOKUP(A127,'Courbe In'!$AA$2:$CD$7,6)","v":{"$error":"#VALUE!"}},{"$f":"HLOOKUP(A127,'Courbe In'!$AA$2:$CD$8,7)","v":{"$error":"#VALUE!"}},{"$f":"HLOOKUP(A127,'Courbe In'!$AA$2:$CD$9,8)","v":{"$error":"#VALUE!"}}]
["2021-05-23",null,{"$f":"HLOOKUP(A128,'Courbe In'!$AA$2:$CD$3,2)","v":{"$error":"#VALUE!"}},{"$f":"HLOOKUP(A128,'Courbe In'!$AA$2:$CD$7,5)","v":{"$error":"#VALUE!"}},{"$f":"HLOOKUP(A128,'Courbe In'!$AA$2:$CD$7,4)","v":{"$error":"#VALUE!"}},{"$f":"HLOOKUP(A128,'Courbe In'!$AA$2:$CD$7,6)","v":{"$error":"#VALUE!"}},{"$f":"HLOOKUP(A128,'Courbe In'!$AA$2:$CD$8,7)","v":{"$error":"#VALUE!"}},{"$f":"HLOOKUP(A128,'Courbe In'!$AA$2:$CD$9,8)","v":{"$error":"#VALUE!"}}]
["2021-05-24",null,{"$f":"HLOOKUP(A129,'Courbe In'!$AA$2:$CD$3,2)","v":{"$error":"#VALUE!"}},{"$f":"HLOOKUP(A129,'Courbe In'!$AA$2:$CD$7,5)","v":{"$error":"#VALUE!"}},{"$f":"HLOOKUP(A129,'Courbe In'!$AA$2:$CD$7,4)","v":{"$error":"#VALUE!"}},{"$f":"HLOOKUP(A129,'Courbe In'!$AA$2:$CD$7,6)","v":{"$error":"#VALUE!"}},{"$f":"HLOOKUP(A129,'Courbe In'!$AA$2:$CD$8,7)","v":{"$error":"#VALUE!"}},{"$f":"HLOOKUP(A129,'Courbe In'!$AA$2:$CD$9,8)","v":{"$error":"#VALUE!"}}]
["2021-05-25",null,{"$f":"HLOOKUP(A130,'Courbe In'!$AA$2:$CD$3,2)","v":{"$error":"#VALUE!"}},{"$f":"HLOOKUP(A130,'Courbe In'!$AA$2:$CD$7,5)","v":{"$error":"#VALUE!"}},{"$f":"HLOOKUP(A130,'Courbe In'!$AA$2:$CD$7,4)","v":{"$error":"#VALUE!"}},{"$f":"HLOOKUP(A130,'Courbe In'!$AA$2:$CD$7,6)","v":{"$error":"#VALUE!"}},{"$f":"HLOOKUP(A130,'Courbe In'!$AA$2:$CD$8,7)","v":{"$error":"#VALUE!"}},{"$f":"HLOOKUP(A130,'Courbe In'!$AA$2:$CD$9,8)","v":{"$error":"#VALUE!"}}]
["2021-05-26",null,{"$f":"HLOOKUP(A131,'Courbe In'!$AA$2:$CD$3,2)","v":{"$error":"#VALUE!"}},{"$f":"HLOOKUP(A131,'Courbe In'!$AA$2:$CD$7,5)","v":{"$error":"#VALUE!"}},{"$f":"HLOOKUP(A131,'Courbe In'!$AA$2:$CD$7,4)","v":{"$error":"#VALUE!"}},{"$f":"HLOOKUP(A131,'Courbe In'!$AA$2:$CD$7,6)","v":{"$error":"#VALUE!"}},{"$f":"HLOOKUP(A131,'Courbe In'!$AA$2:$CD$8,7)","v":{"$error":"#VALUE!"}},{"$f":"HLOOKUP(A131,'Courbe In'!$AA$2:$CD$9,8)","v":{"$error":"#VALUE!"}}]
[{"$f":"A131+1","v":"2021-05-27"},null,{"$f":"HLOOKUP(A132,'Courbe In'!$AA$2:$CD$3,2)","v":{"$error":"#VALUE!"}},{"$f":"HLOOKUP(A132,'Courbe In'!$AA$2:$CD$7,5)","v":{"$error":"#VALUE!"}},{"$f":"HLOOKUP(A132,'Courbe In'!$AA$2:$CD$7,4)","v":{"$error":"#VALUE!"}},{"$f":"HLOOKUP(A132,'Courbe In'!$AA$2:$CD$7,6)","v":{"$error":"#VALUE!"}},{"$f":"HLOOKUP(A132,'Courbe In'!$AA$2:$CD$8,7)","v":{"$error":"#VALUE!"}},{"$f":"HLOOKUP(A132,'Courbe In'!$AA$2:$CD$9,8)","v":{"$error":"#VALUE!"}}]
["2021-05-28",null,{"$f":"HLOOKUP(A133,'Courbe In'!$AA$2:$CD$3,2)","v":{"$error":"#VALUE!"}},{"$f":"HLOOKUP(A133,'Courbe In'!$AA$2:$CD$7,5)","v":{"$error":"#VALUE!"}},{"$f":"HLOOKUP(A133,'Courbe In'!$AA$2:$CD$7,4)","v":{"$error":"#VALUE!"}},{"$f":"HLOOKUP(A133,'Courbe In'!$AA$2:$CD$7,6)","v":{"$error":"#VALUE!"}},{"$f":"HLOOKUP(A133,'Courbe In'!$AA$2:$CD$8,7)","v":{"$error":"#VALUE!"}},{"$f":"HLOOKUP(A133,'Courbe In'!$AA$2:$CD$9,8)","v":{"$error":"#VALUE!"}}]
["2021-05-29",null,{"$f":"HLOOKUP(A134,'Courbe In'!$AA$2:$CD$3,2)","v":{"$error":"#VALUE!"}},{"$f":"HLOOKUP(A134,'Courbe In'!$AA$2:$CD$7,5)","v":{"$error":"#VALUE!"}},{"$f":"HLOOKUP(A134,'Courbe In'!$AA$2:$CD$7,4)","v":{"$error":"#VALUE!"}},{"$f":"HLOOKUP(A134,'Courbe In'!$AA$2:$CD$7,6)","v":{"$error":"#VALUE!"}},{"$f":"HLOOKUP(A134,'Courbe In'!$AA$2:$CD$8,7)","v":{"$error":"#VALUE!"}},{"$f":"HLOOKUP(A134,'Courbe In'!$AA$2:$CD$9,8)","v":{"$error":"#VALUE!"}}]
["2021-05-30",null,{"$f":"HLOOKUP(A135,'Courbe In'!$AA$2:$CD$3,2)","v":{"$error":"#VALUE!"}},{"$f":"HLOOKUP(A135,'Courbe In'!$AA$2:$CD$7,5)","v":{"$error":"#VALUE!"}},{"$f":"HLOOKUP(A135,'Courbe In'!$AA$2:$CD$7,4)","v":{"$error":"#VALUE!"}},{"$f":"HLOOKUP(A135,'Courbe In'!$AA$2:$CD$7,6)","v":{"$error":"#VALUE!"}},{"$f":"HLOOKUP(A135,'Courbe In'!$AA$2:$CD$8,7)","v":{"$error":"#VALUE!"}},{"$f":"HLOOKUP(A135,'Courbe In'!$AA$2:$CD$9,8)","v":{"$error":"#VALUE!"}}]
["2021-05-31",null,{"$f":"HLOOKUP(A136,'Courbe In'!$AA$2:$CD$3,2)","v":{"$error":"#VALUE!"}},{"$f":"HLOOKUP(A136,'Courbe In'!$AA$2:$CD$7,5)","v":{"$error":"#VALUE!"}},{"$f":"HLOOKUP(A136,'Courbe In'!$AA$2:$CD$7,4)","v":{"$error":"#VALUE!"}},{"$f":"HLOOKUP(A136,'Courbe In'!$AA$2:$CD$7,6)","v":{"$error":"#VALUE!"}},{"$f":"HLOOKUP(A136,'Courbe In'!$AA$2:$CD$8,7)","v":{"$error":"#VALUE!"}},{"$f":"HLOOKUP(A136,'Courbe In'!$AA$2:$CD$9,8)","v":{"$error":"#VALUE!"}}]
["2021-06-01",null,{"$f":"HLOOKUP(A137,'Courbe In'!$AA$2:$CD$3,2)","v":{"$error":"#VALUE!"}},{"$f":"HLOOKUP(A137,'Courbe In'!$AA$2:$CD$7,5)","v":{"$error":"#VALUE!"}},{"$f":"HLOOKUP(A137,'Courbe In'!$AA$2:$CD$7,4)","v":{"$error":"#VALUE!"}},{"$f":"HLOOKUP(A137,'Courbe In'!$AA$2:$CD$7,6)","v":{"$error":"#VALUE!"}},{"$f":"HLOOKUP(A137,'Courbe In'!$AA$2:$CD$8,7)","v":{"$error":"#VALUE!"}},{"$f":"HLOOKUP(A137,'Courbe In'!$AA$2:$CD$9,8)","v":{"$error":"#VALUE!"}}]
["2021-06-02",null,{"$f":"HLOOKUP(A138,'Courbe In'!$AA$2:$CD$3,2)","v":{"$error":"#VALUE!"}},{"$f":"HLOOKUP(A138,'Courbe In'!$AA$2:$CD$7,5)","v":{"$error":"#VALUE!"}},{"$f":"HLOOKUP(A138,'Courbe In'!$AA$2:$CD$7,4)","v":{"$error":"#VALUE!"}},{"$f":"HLOOKUP(A138,'Courbe In'!$AA$2:$CD$7,6)","v":{"$error":"#VALUE!"}},{"$f":"HLOOKUP(A138,'Courbe In'!$AA$2:$CD$8,7)","v":{"$error":"#VALUE!"}},{"$f":"HLOOKUP(A138,'Courbe In'!$AA$2:$CD$9,8)","v":{"$error":"#VALUE!"}}]
["2021-06-03",null,{"$f":"HLOOKUP(A139,'Courbe In'!$AA$2:$CD$3,2)","v":{"$error":"#VALUE!"}},{"$f":"HLOOKUP(A139,'Courbe In'!$AA$2:$CD$7,5)","v":{"$error":"#VALUE!"}},{"$f":"HLOOKUP(A139,'Courbe In'!$AA$2:$CD$7,4)","v":{"$error":"#VALUE!"}},{"$f":"HLOOKUP(A139,'Courbe In'!$AA$2:$CD$7,6)","v":{"$error":"#VALUE!"}},{"$f":"HLOOKUP(A139,'Courbe In'!$AA$2:$CD$8,7)","v":{"$error":"#VALUE!"}},{"$f":"HLOOKUP(A139,'Courbe In'!$AA$2:$CD$9,8)","v":{"$error":"#VALUE!"}}]
["2021-06-04",null,{"$f":"HLOOKUP(A140,'Courbe In'!$AA$2:$CD$3,2)","v":{"$error":"#VALUE!"}},{"$f":"HLOOKUP(A140,'Courbe In'!$AA$2:$CD$7,5)","v":{"$error":"#VALUE!"}},{"$f":"HLOOKUP(A140,'Courbe In'!$AA$2:$CD$7,4)","v":{"$error":"#VALUE!"}},{"$f":"HLOOKUP(A140,'Courbe In'!$AA$2:$CD$7,6)","v":{"$error":"#VALUE!"}},{"$f":"HLOOKUP(A140,'Courbe In'!$AA$2:$CD$8,7)","v":{"$error":"#VALUE!"}},{"$f":"HLOOKUP(A140,'Courbe In'!$AA$2:$CD$9,8)","v":{"$error":"#VALUE!"}}]
["2021-06-05",null,{"$f":"HLOOKUP(A141,'Courbe In'!$AA$2:$CD$3,2)","v":{"$error":"#VALUE!"}},{"$f":"HLOOKUP(A141,'Courbe In'!$AA$2:$CD$7,5)","v":{"$error":"#VALUE!"}},{"$f":"HLOOKUP(A141,'Courbe In'!$AA$2:$CD$7,4)","v":{"$error":"#VALUE!"}},{"$f":"HLOOKUP(A141,'Courbe In'!$AA$2:$CD$7,6)","v":{"$error":"#VALUE!"}},{"$f":"HLOOKUP(A141,'Courbe In'!$AA$2:$CD$8,7)","v":{"$error":"#VALUE!"}},{"$f":"HLOOKUP(A141,'Courbe In'!$AA$2:$CD$9,8)","v":{"$error":"#VALUE!"}}]
["2021-06-06",null,{"$f":"HLOOKUP(A142,'Courbe In'!$AA$2:$CD$3,2)","v":{"$error":"#VALUE!"}},{"$f":"HLOOKUP(A142,'Courbe In'!$AA$2:$CD$7,5)","v":{"$error":"#VALUE!"}},{"$f":"HLOOKUP(A142,'Courbe In'!$AA$2:$CD$7,4)","v":{"$error":"#VALUE!"}},{"$f":"HLOOKUP(A142,'Courbe In'!$AA$2:$CD$7,6)","v":{"$error":"#VALUE!"}},{"$f":"HLOOKUP(A142,'Courbe In'!$AA$2:$CD$8,7)","v":{"$error":"#VALUE!"}},{"$f":"HLOOKUP(A142,'Courbe In'!$AA$2:$CD$9,8)","v":{"$error":"#VALUE!"}}]
["2021-06-07",null,{"$f":"HLOOKUP(A143,'Courbe In'!$AA$2:$CD$3,2)","v":{"$error":"#VALUE!"}},{"$f":"HLOOKUP(A143,'Courbe In'!$AA$2:$CD$7,5)","v":{"$error":"#VALUE!"}},{"$f":"HLOOKUP(A143,'Courbe In'!$AA$2:$CD$7,4)","v":{"$error":"#VALUE!"}},{"$f":"HLOOKUP(A143,'Courbe In'!$AA$2:$CD$7,6)","v":{"$error":"#VALUE!"}},{"$f":"HLOOKUP(A143,'Courbe In'!$AA$2:$CD$8,7)","v":{"$error":"#VALUE!"}},{"$f":"HLOOKUP(A143,'Courbe In'!$AA$2:$CD$9,8)","v":{"$error":"#VALUE!"}}]
["2021-06-08",null,{"$f":"HLOOKUP(A144,'Courbe In'!$AA$2:$CD$3,2)","v":{"$error":"#VALUE!"}},{"$f":"HLOOKUP(A144,'Courbe In'!$AA$2:$CD$7,5)","v":{"$error":"#VALUE!"}},{"$f":"HLOOKUP(A144,'Courbe In'!$AA$2:$CD$7,4)","v":{"$error":"#VALUE!"}},{"$f":"HLOOKUP(A144,'Courbe In'!$AA$2:$CD$7,6)","v":{"$error":"#VALUE!"}},{"$f":"HLOOKUP(A144,'Courbe In'!$AA$2:$CD$8,7)","v":{"$error":"#VALUE!"}},{"$f":"HLOOKUP(A144,'Courbe In'!$AA$2:$CD$9,8)","v":{"$error":"#VALUE!"}}]
["2021-06-09",null,{"$f":"HLOOKUP(A145,'Courbe In'!$AA$2:$CD$3,2)","v":{"$error":"#VALUE!"}},{"$f":"HLOOKUP(A145,'Courbe In'!$AA$2:$CD$7,5)","v":{"$error":"#VALUE!"}},{"$f":"HLOOKUP(A145,'Courbe In'!$AA$2:$CD$7,4)","v":{"$error":"#VALUE!"}},{"$f":"HLOOKUP(A145,'Courbe In'!$AA$2:$CD$7,6)","v":{"$error":"#VALUE!"}},{"$f":"HLOOKUP(A145,'Courbe In'!$AA$2:$CD$8,7)","v":{"$error":"#VALUE!"}},{"$f":"HLOOKUP(A145,'Courbe In'!$AA$2:$CD$9,8)","v":{"$error":"#VALUE!"}}]
["2021-06-10",null,{"$f":"HLOOKUP(A146,'Courbe In'!$AA$2:$CD$3,2)","v":{"$error":"#VALUE!"}},{"$f":"HLOOKUP(A146,'Courbe In'!$AA$2:$CD$7,5)","v":{"$error":"#VALUE!"}},{"$f":"HLOOKUP(A146,'Courbe In'!$AA$2:$CD$7,4)","v":{"$error":"#VALUE!"}},{"$f":"HLOOKUP(A146,'Courbe In'!$AA$2:$CD$7,6)","v":{"$error":"#VALUE!"}},{"$f":"HLOOKUP(A146,'Courbe In'!$AA$2:$CD$8,7)","v":{"$error":"#VALUE!"}},{"$f":"HLOOKUP(A146,'Courbe In'!$AA$2:$CD$9,8)","v":{"$error":"#VALUE!"}}]
["2021-06-11",null,{"$f":"HLOOKUP(A147,'Courbe In'!$AA$2:$CD$3,2)","v":{"$error":"#VALUE!"}},{"$f":"HLOOKUP(A147,'Courbe In'!$AA$2:$CD$7,5)","v":{"$error":"#VALUE!"}},{"$f":"HLOOKUP(A147,'Courbe In'!$AA$2:$CD$7,4)","v":{"$error":"#VALUE!"}},{"$f":"HLOOKUP(A147,'Courbe In'!$AA$2:$CD$7,6)","v":{"$error":"#VALUE!"}},{"$f":"HLOOKUP(A147,'Courbe In'!$AA$2:$CD$8,7)","v":{"$error":"#VALUE!"}},{"$f":"HLOOKUP(A147,'Courbe In'!$AA$2:$CD$9,8)","v":{"$error":"#VALUE!"}}]
["2021-06-12",null,{"$f":"HLOOKUP(A148,'Courbe In'!$AA$2:$CD$3,2)","v":{"$error":"#VALUE!"}},{"$f":"HLOOKUP(A148,'Courbe In'!$AA$2:$CD$7,5)","v":{"$error":"#VALUE!"}},{"$f":"HLOOKUP(A148,'Courbe In'!$AA$2:$CD$7,4)","v":{"$error":"#VALUE!"}},{"$f":"HLOOKUP(A148,'Courbe In'!$AA$2:$CD$7,6)","v":{"$error":"#VALUE!"}},{"$f":"HLOOKUP(A148,'Courbe In'!$AA$2:$CD$8,7)","v":{"$error":"#VALUE!"}},{"$f":"HLOOKUP(A148,'Courbe In'!$AA$2:$CD$9,8)","v":{"$error":"#VALUE!"}}]
["2021-06-13",null,{"$f":"HLOOKUP(A149,'Courbe In'!$AA$2:$CD$3,2)","v":{"$error":"#VALUE!"}},{"$f":"HLOOKUP(A149,'Courbe In'!$AA$2:$CD$7,5)","v":{"$error":"#VALUE!"}},{"$f":"HLOOKUP(A149,'Courbe In'!$AA$2:$CD$7,4)","v":{"$error":"#VALUE!"}},{"$f":"HLOOKUP(A149,'Courbe In'!$AA$2:$CD$7,6)","v":{"$error":"#VALUE!"}},{"$f":"HLOOKUP(A149,'Courbe In'!$AA$2:$CD$8,7)","v":{"$error":"#VALUE!"}},{"$f":"HLOOKUP(A149,'Courbe In'!$AA$2:$CD$9,8)","v":{"$error":"#VALUE!"}}]
["2021-06-14",null,{"$f":"HLOOKUP(A150,'Courbe In'!$AA$2:$CD$3,2)","v":{"$error":"#VALUE!"}},{"$f":"HLOOKUP(A150,'Courbe In'!$AA$2:$CD$7,5)","v":{"$error":"#VALUE!"}},{"$f":"HLOOKUP(A150,'Courbe In'!$AA$2:$CD$7,4)","v":{"$error":"#VALUE!"}},{"$f":"HLOOKUP(A150,'Courbe In'!$AA$2:$CD$7,6)","v":{"$error":"#VALUE!"}},{"$f":"HLOOKUP(A150,'Courbe In'!$AA$2:$CD$8,7)","v":{"$error":"#VALUE!"}},{"$f":"HLOOKUP(A150,'Courbe In'!$AA$2:$CD$9,8)","v":{"$error":"#VALUE!"}}]
["2021-06-15",null,{"$f":"HLOOKUP(A151,'Courbe In'!$AA$2:$CD$3,2)","v":{"$error":"#VALUE!"}},{"$f":"HLOOKUP(A151,'Courbe In'!$AA$2:$CD$7,5)","v":{"$error":"#VALUE!"}},{"$f":"HLOOKUP(A151,'Courbe In'!$AA$2:$CD$7,4)","v":{"$error":"#VALUE!"}},{"$f":"HLOOKUP(A151,'Courbe In'!$AA$2:$CD$7,6)","v":{"$error":"#VALUE!"}},{"$f":"HLOOKUP(A151,'Courbe In'!$AA$2:$CD$8,7)","v":{"$error":"#VALUE!"}},{"$f":"HLOOKUP(A151,'Courbe In'!$AA$2:$CD$9,8)","v":{"$error":"#VALUE!"}}]
["2021-06-16",null,{"$f":"HLOOKUP(A152,'Courbe In'!$AA$2:$CD$3,2)","v":{"$error":"#VALUE!"}},{"$f":"HLOOKUP(A152,'Courbe In'!$AA$2:$CD$7,5)","v":{"$error":"#VALUE!"}},{"$f":"HLOOKUP(A152,'Courbe In'!$AA$2:$CD$7,4)","v":{"$error":"#VALUE!"}},{"$f":"HLOOKUP(A152,'Courbe In'!$AA$2:$CD$7,6)","v":{"$error":"#VALUE!"}},{"$f":"HLOOKUP(A152,'Courbe In'!$AA$2:$CD$8,7)","v":{"$error":"#VALUE!"}},{"$f":"HLOOKUP(A152,'Courbe In'!$AA$2:$CD$9,8)","v":{"$error":"#VALUE!"}}]
["2021-06-17",null,{"$f":"HLOOKUP(A153,'Courbe In'!$AA$2:$CD$3,2)","v":{"$error":"#VALUE!"}},{"$f":"HLOOKUP(A153,'Courbe In'!$AA$2:$CD$7,5)","v":{"$error":"#VALUE!"}},{"$f":"HLOOKUP(A153,'Courbe In'!$AA$2:$CD$7,4)","v":{"$error":"#VALUE!"}},{"$f":"HLOOKUP(A153,'Courbe In'!$AA$2:$CD$7,6)","v":{"$error":"#VALUE!"}},{"$f":"HLOOKUP(A153,'Courbe In'!$AA$2:$CD$8,7)","v":{"$error":"#VALUE!"}},{"$f":"HLOOKUP(A153,'Courbe In'!$AA$2:$CD$9,8)","v":{"$error":"#VALUE!"}}]
["2021-06-18",null,{"$f":"HLOOKUP(A154,'Courbe In'!$AA$2:$CD$3,2)","v":{"$error":"#VALUE!"}},{"$f":"HLOOKUP(A154,'Courbe In'!$AA$2:$CD$7,5)","v":{"$error":"#VALUE!"}},{"$f":"HLOOKUP(A154,'Courbe In'!$AA$2:$CD$7,4)","v":{"$error":"#VALUE!"}},{"$f":"HLOOKUP(A154,'Courbe In'!$AA$2:$CD$7,6)","v":{"$error":"#VALUE!"}},{"$f":"HLOOKUP(A154,'Courbe In'!$AA$2:$CD$8,7)","v":{"$error":"#VALUE!"}},{"$f":"HLOOKUP(A154,'Courbe In'!$AA$2:$CD$9,8)","v":{"$error":"#VALUE!"}}]
["2021-06-19",null,{"$f":"HLOOKUP(A155,'Courbe In'!$AA$2:$CD$3,2)","v":{"$error":"#VALUE!"}},{"$f":"HLOOKUP(A155,'Courbe In'!$AA$2:$CD$7,5)","v":{"$error":"#VALUE!"}},{"$f":"HLOOKUP(A155,'Courbe In'!$AA$2:$CD$7,4)","v":{"$error":"#VALUE!"}},{"$f":"HLOOKUP(A155,'Courbe In'!$AA$2:$CD$7,6)","v":{"$error":"#VALUE!"}},{"$f":"HLOOKUP(A155,'Courbe In'!$AA$2:$CD$8,7)","v":{"$error":"#VALUE!"}},{"$f":"HLOOKUP(A155,'Courbe In'!$AA$2:$CD$9,8)","v":{"$error":"#VALUE!"}}]
["2021-06-20",null,{"$f":"HLOOKUP(A156,'Courbe In'!$AA$2:$CD$3,2)","v":{"$error":"#VALUE!"}},{"$f":"HLOOKUP(A156,'Courbe In'!$AA$2:$CD$7,5)","v":{"$error":"#VALUE!"}},{"$f":"HLOOKUP(A156,'Courbe In'!$AA$2:$CD$7,4)","v":{"$error":"#VALUE!"}},{"$f":"HLOOKUP(A156,'Courbe In'!$AA$2:$CD$7,6)","v":{"$error":"#VALUE!"}},{"$f":"HLOOKUP(A156,'Courbe In'!$AA$2:$CD$8,7)","v":{"$error":"#VALUE!"}},{"$f":"HLOOKUP(A156,'Courbe In'!$AA$2:$CD$9,8)","v":{"$error":"#VALUE!"}}]
["2021-06-21",null,{"$f":"HLOOKUP(A157,'Courbe In'!$AA$2:$CD$3,2)","v":{"$error":"#VALUE!"}},{"$f":"HLOOKUP(A157,'Courbe In'!$AA$2:$CD$7,5)","v":{"$error":"#VALUE!"}},{"$f":"HLOOKUP(A157,'Courbe In'!$AA$2:$CD$7,4)","v":{"$error":"#VALUE!"}},{"$f":"HLOOKUP(A157,'Courbe In'!$AA$2:$CD$7,6)","v":{"$error":"#VALUE!"}},{"$f":"HLOOKUP(A157,'Courbe In'!$AA$2:$CD$8,7)","v":{"$error":"#VALUE!"}},{"$f":"HLOOKUP(A157,'Courbe In'!$AA$2:$CD$9,8)","v":{"$error":"#VALUE!"}}]
["2021-06-22",null,{"$f":"HLOOKUP(A158,'Courbe In'!$AA$2:$CD$3,2)","v":{"$error":"#VALUE!"}},{"$f":"HLOOKUP(A158,'Courbe In'!$AA$2:$CD$7,5)","v":{"$error":"#VALUE!"}},{"$f":"HLOOKUP(A158,'Courbe In'!$AA$2:$CD$7,4)","v":{"$error":"#VALUE!"}},{"$f":"HLOOKUP(A158,'Courbe In'!$AA$2:$CD$7,6)","v":{"$error":"#VALUE!"}},{"$f":"HLOOKUP(A158,'Courbe In'!$AA$2:$CD$8,7)","v":{"$error":"#VALUE!"}},{"$f":"HLOOKUP(A158,'Courbe In'!$AA$2:$CD$9,8)","v":{"$error":"#VALUE!"}}]
["2021-06-23",null,{"$f":"HLOOKUP(A159,'Courbe In'!$AA$2:$CD$3,2)","v":{"$error":"#VALUE!"}},{"$f":"HLOOKUP(A159,'Courbe In'!$AA$2:$CD$7,5)","v":{"$error":"#VALUE!"}},{"$f":"HLOOKUP(A159,'Courbe In'!$AA$2:$CD$7,4)","v":{"$error":"#VALUE!"}},{"$f":"HLOOKUP(A159,'Courbe In'!$AA$2:$CD$7,6)","v":{"$error":"#VALUE!"}},{"$f":"HLOOKUP(A159,'Courbe In'!$AA$2:$CD$8,7)","v":{"$error":"#VALUE!"}},{"$f":"HLOOKUP(A159,'Courbe In'!$AA$2:$CD$9,8)","v":{"$error":"#VALUE!"}}]
["2021-06-24",null,{"$f":"HLOOKUP(A160,'Courbe In'!$AA$2:$CD$3,2)","v":{"$error":"#VALUE!"}},{"$f":"HLOOKUP(A160,'Courbe In'!$AA$2:$CD$7,5)","v":{"$error":"#VALUE!"}},{"$f":"HLOOKUP(A160,'Courbe In'!$AA$2:$CD$7,4)","v":{"$error":"#VALUE!"}},{"$f":"HLOOKUP(A160,'Courbe In'!$AA$2:$CD$7,6)","v":{"$error":"#VALUE!"}},{"$f":"HLOOKUP(A160,'Courbe In'!$AA$2:$CD$8,7)","v":{"$error":"#VALUE!"}},{"$f":"HLOOKUP(A160,'Courbe In'!$AA$2:$CD$9,8)","v":{"$error":"#VALUE!"}}]
["2021-06-25",null,{"$f":"HLOOKUP(A161,'Courbe In'!$AA$2:$CD$3,2)","v":{"$error":"#VALUE!"}},{"$f":"HLOOKUP(A161,'Courbe In'!$AA$2:$CD$7,5)","v":{"$error":"#VALUE!"}},{"$f":"HLOOKUP(A161,'Courbe In'!$AA$2:$CD$7,4)","v":{"$error":"#VALUE!"}},{"$f":"HLOOKUP(A161,'Courbe In'!$AA$2:$CD$7,6)","v":{"$error":"#VALUE!"}},{"$f":"HLOOKUP(A161,'Courbe In'!$AA$2:$CD$8,7)","v":{"$error":"#VALUE!"}},{"$f":"HLOOKUP(A161,'Courbe In'!$AA$2:$CD$9,8)","v":{"$error":"#VALUE!"}}]
["2021-06-26",null,{"$f":"HLOOKUP(A162,'Courbe In'!$AA$2:$CD$3,2)","v":{"$error":"#VALUE!"}},{"$f":"HLOOKUP(A162,'Courbe In'!$AA$2:$CD$7,5)","v":{"$error":"#VALUE!"}},{"$f":"HLOOKUP(A162,'Courbe In'!$AA$2:$CD$7,4)","v":{"$error":"#VALUE!"}},{"$f":"HLOOKUP(A162,'Courbe In'!$AA$2:$CD$7,6)","v":{"$error":"#VALUE!"}},{"$f":"HLOOKUP(A162,'Courbe In'!$AA$2:$CD$8,7)","v":{"$error":"#VALUE!"}},{"$f":"HLOOKUP(A162,'Courbe In'!$AA$2:$CD$9,8)","v":{"$error":"#VALUE!"}}]
["2021-06-27",null,{"$f":"HLOOKUP(A163,'Courbe In'!$AA$2:$CD$3,2)","v":{"$error":"#VALUE!"}},{"$f":"HLOOKUP(A163,'Courbe In'!$AA$2:$CD$7,5)","v":{"$error":"#VALUE!"}},{"$f":"HLOOKUP(A163,'Courbe In'!$AA$2:$CD$7,4)","v":{"$error":"#VALUE!"}},{"$f":"HLOOKUP(A163,'Courbe In'!$AA$2:$CD$7,6)","v":{"$error":"#VALUE!"}},{"$f":"HLOOKUP(A163,'Courbe In'!$AA$2:$CD$8,7)","v":{"$error":"#VALUE!"}},{"$f":"HLOOKUP(A163,'Courbe In'!$AA$2:$CD$9,8)","v":{"$error":"#VALUE!"}}]
["2021-06-28",null,{"$f":"HLOOKUP(A164,'Courbe In'!$AA$2:$CD$3,2)","v":{"$error":"#VALUE!"}},{"$f":"HLOOKUP(A164,'Courbe In'!$AA$2:$CD$7,5)","v":{"$error":"#VALUE!"}},{"$f":"HLOOKUP(A164,'Courbe In'!$AA$2:$CD$7,4)","v":{"$error":"#VALUE!"}},{"$f":"HLOOKUP(A164,'Courbe In'!$AA$2:$CD$7,6)","v":{"$error":"#VALUE!"}},{"$f":"HLOOKUP(A164,'Courbe In'!$AA$2:$CD$8,7)","v":{"$error":"#VALUE!"}},{"$f":"HLOOKUP(A164,'Courbe In'!$AA$2:$CD$9,8)","v":{"$error":"#VALUE!"}}]
["2021-06-29",null,{"$f":"HLOOKUP(A165,'Courbe In'!$AA$2:$CD$3,2)","v":{"$error":"#VALUE!"}},{"$f":"HLOOKUP(A165,'Courbe In'!$AA$2:$CD$7,5)","v":{"$error":"#VALUE!"}},{"$f":"HLOOKUP(A165,'Courbe In'!$AA$2:$CD$7,4)","v":{"$error":"#VALUE!"}},{"$f":"HLOOKUP(A165,'Courbe In'!$AA$2:$CD$7,6)","v":{"$error":"#VALUE!"}},{"$f":"HLOOKUP(A165,'Courbe In'!$AA$2:$CD$8,7)","v":{"$error":"#VALUE!"}},{"$f":"HLOOKUP(A165,'Courbe In'!$AA$2:$CD$9,8)","v":{"$error":"#VALUE!"}}]
["2021-06-30",null,{"$f":"HLOOKUP(A166,'Courbe In'!$AA$2:$CD$3,2)","v":{"$error":"#VALUE!"}},{"$f":"HLOOKUP(A166,'Courbe In'!$AA$2:$CD$7,5)","v":{"$error":"#VALUE!"}},{"$f":"HLOOKUP(A166,'Courbe In'!$AA$2:$CD$7,4)","v":{"$error":"#VALUE!"}},{"$f":"HLOOKUP(A166,'Courbe In'!$AA$2:$CD$7,6)","v":{"$error":"#VALUE!"}},{"$f":"HLOOKUP(A166,'Courbe In'!$AA$2:$CD$8,7)","v":{"$error":"#VALUE!"}},{"$f":"HLOOKUP(A166,'Courbe In'!$AA$2:$CD$9,8)","v":{"$error":"#VALUE!"}}]
["2021-07-01",null,{"$f":"HLOOKUP(A167,'Courbe In'!$AA$2:$CD$3,2)","v":{"$error":"#VALUE!"}},{"$f":"HLOOKUP(A167,'Courbe In'!$AA$2:$CD$7,5)","v":{"$error":"#VALUE!"}},{"$f":"HLOOKUP(A167,'Courbe In'!$AA$2:$CD$7,4)","v":{"$error":"#VALUE!"}},{"$f":"HLOOKUP(A167,'Courbe In'!$AA$2:$CD$7,6)","v":{"$error":"#VALUE!"}},{"$f":"HLOOKUP(A167,'Courbe In'!$AA$2:$CD$8,7)","v":{"$error":"#VALUE!"}},{"$f":"HLOOKUP(A167,'Courbe In'!$AA$2:$CD$9,8)","v":{"$error":"#VALUE!"}}]
["2021-07-02",null,{"$f":"HLOOKUP(A168,'Courbe In'!$AA$2:$CD$3,2)","v":{"$error":"#VALUE!"}},{"$f":"HLOOKUP(A168,'Courbe In'!$AA$2:$CD$7,5)","v":{"$error":"#VALUE!"}},{"$f":"HLOOKUP(A168,'Courbe In'!$AA$2:$CD$7,4)","v":{"$error":"#VALUE!"}},{"$f":"HLOOKUP(A168,'Courbe In'!$AA$2:$CD$7,6)","v":{"$error":"#VALUE!"}},{"$f":"HLOOKUP(A168,'Courbe In'!$AA$2:$CD$8,7)","v":{"$error":"#VALUE!"}},{"$f":"HLOOKUP(A168,'Courbe In'!$AA$2:$CD$9,8)","v":{"$error":"#VALUE!"}}]
["2021-07-03",null,{"$f":"HLOOKUP(A169,'Courbe In'!$AA$2:$CD$3,2)","v":{"$error":"#VALUE!"}},{"$f":"HLOOKUP(A169,'Courbe In'!$AA$2:$CD$7,5)","v":{"$error":"#VALUE!"}},{"$f":"HLOOKUP(A169,'Courbe In'!$AA$2:$CD$7,4)","v":{"$error":"#VALUE!"}},{"$f":"HLOOKUP(A169,'Courbe In'!$AA$2:$CD$7,6)","v":{"$error":"#VALUE!"}},{"$f":"HLOOKUP(A169,'Courbe In'!$AA$2:$CD$8,7)","v":{"$error":"#VALUE!"}},{"$f":"HLOOKUP(A169,'Courbe In'!$AA$2:$CD$9,8)","v":{"$error":"#VALUE!"}}]
["2021-07-04",null,{"$f":"HLOOKUP(A170,'Courbe In'!$AA$2:$CD$3,2)","v":{"$error":"#VALUE!"}},{"$f":"HLOOKUP(A170,'Courbe In'!$AA$2:$CD$7,5)","v":{"$error":"#VALUE!"}},{"$f":"HLOOKUP(A170,'Courbe In'!$AA$2:$CD$7,4)","v":{"$error":"#VALUE!"}},{"$f":"HLOOKUP(A170,'Courbe In'!$AA$2:$CD$7,6)","v":{"$error":"#VALUE!"}},{"$f":"HLOOKUP(A170,'Courbe In'!$AA$2:$CD$8,7)","v":{"$error":"#VALUE!"}},{"$f":"HLOOKUP(A170,'Courbe In'!$AA$2:$CD$9,8)","v":{"$error":"#VALUE!"}}]
["2021-07-05",null,{"$f":"HLOOKUP(A171,'Courbe In'!$AA$2:$CD$3,2)","v":{"$error":"#VALUE!"}},{"$f":"HLOOKUP(A171,'Courbe In'!$AA$2:$CD$7,5)","v":{"$error":"#VALUE!"}},{"$f":"HLOOKUP(A171,'Courbe In'!$AA$2:$CD$7,4)","v":{"$error":"#VALUE!"}},{"$f":"HLOOKUP(A171,'Courbe In'!$AA$2:$CD$7,6)","v":{"$error":"#VALUE!"}},{"$f":"HLOOKUP(A171,'Courbe In'!$AA$2:$CD$8,7)","v":{"$error":"#VALUE!"}},{"$f":"HLOOKUP(A171,'Courbe In'!$AA$2:$CD$9,8)","v":{"$error":"#VALUE!"}}]
["2021-07-06",null,{"$f":"HLOOKUP(A172,'Courbe In'!$AA$2:$CD$3,2)","v":{"$error":"#VALUE!"}},{"$f":"HLOOKUP(A172,'Courbe In'!$AA$2:$CD$7,5)","v":{"$error":"#VALUE!"}},{"$f":"HLOOKUP(A172,'Courbe In'!$AA$2:$CD$7,4)","v":{"$error":"#VALUE!"}},{"$f":"HLOOKUP(A172,'Courbe In'!$AA$2:$CD$7,6)","v":{"$error":"#VALUE!"}},{"$f":"HLOOKUP(A172,'Courbe In'!$AA$2:$CD$8,7)","v":{"$error":"#VALUE!"}},{"$f":"HLOOKUP(A172,'Courbe In'!$AA$2:$CD$9,8)","v":{"$error":"#VALUE!"}}]
["2021-07-07",null,{"$f":"HLOOKUP(A173,'Courbe In'!$AA$2:$CD$3,2)","v":{"$error":"#VALUE!"}},{"$f":"HLOOKUP(A173,'Courbe In'!$AA$2:$CD$7,5)","v":{"$error":"#VALUE!"}},{"$f":"HLOOKUP(A173,'Courbe In'!$AA$2:$CD$7,4)","v":{"$error":"#VALUE!"}},{"$f":"HLOOKUP(A173,'Courbe In'!$AA$2:$CD$7,6)","v":{"$error":"#VALUE!"}},{"$f":"HLOOKUP(A173,'Courbe In'!$AA$2:$CD$8,7)","v":{"$error":"#VALUE!"}},{"$f":"HLOOKUP(A173,'Courbe In'!$AA$2:$CD$9,8)","v":{"$error":"#VALUE!"}}]
["2021-07-08",null,{"$f":"HLOOKUP(A174,'Courbe In'!$AA$2:$CD$3,2)","v":{"$error":"#VALUE!"}},{"$f":"HLOOKUP(A174,'Courbe In'!$AA$2:$CD$7,5)","v":{"$error":"#VALUE!"}},{"$f":"HLOOKUP(A174,'Courbe In'!$AA$2:$CD$7,4)","v":{"$error":"#VALUE!"}},{"$f":"HLOOKUP(A174,'Courbe In'!$AA$2:$CD$7,6)","v":{"$error":"#VALUE!"}},{"$f":"HLOOKUP(A174,'Courbe In'!$AA$2:$CD$8,7)","v":{"$error":"#VALUE!"}},{"$f":"HLOOKUP(A174,'Courbe In'!$AA$2:$CD$9,8)","v":{"$error":"#VALUE!"}}]
["2021-07-09",null,{"$f":"HLOOKUP(A175,'Courbe In'!$AA$2:$CD$3,2)","v":{"$error":"#VALUE!"}},{"$f":"HLOOKUP(A175,'Courbe In'!$AA$2:$CD$7,5)","v":{"$error":"#VALUE!"}},{"$f":"HLOOKUP(A175,'Courbe In'!$AA$2:$CD$7,4)","v":{"$error":"#VALUE!"}},{"$f":"HLOOKUP(A175,'Courbe In'!$AA$2:$CD$7,6)","v":{"$error":"#VALUE!"}},{"$f":"HLOOKUP(A175,'Courbe In'!$AA$2:$CD$8,7)","v":{"$error":"#VALUE!"}},{"$f":"HLOOKUP(A175,'Courbe In'!$AA$2:$CD$9,8)","v":{"$error":"#VALUE!"}}]
["2021-07-10",null,{"$f":"HLOOKUP(A176,'Courbe In'!$AA$2:$CD$3,2)","v":{"$error":"#VALUE!"}},{"$f":"HLOOKUP(A176,'Courbe In'!$AA$2:$CD$7,5)","v":{"$error":"#VALUE!"}},{"$f":"HLOOKUP(A176,'Courbe In'!$AA$2:$CD$7,4)","v":{"$error":"#VALUE!"}},{"$f":"HLOOKUP(A176,'Courbe In'!$AA$2:$CD$7,6)","v":{"$error":"#VALUE!"}},{"$f":"HLOOKUP(A176,'Courbe In'!$AA$2:$CD$8,7)","v":{"$error":"#VALUE!"}},{"$f":"HLOOKUP(A176,'Courbe In'!$AA$2:$CD$9,8)","v":{"$error":"#VALUE!"}}]
["2021-07-11",null,{"$f":"HLOOKUP(A177,'Courbe In'!$AA$2:$CD$3,2)","v":{"$error":"#VALUE!"}},{"$f":"HLOOKUP(A177,'Courbe In'!$AA$2:$CD$7,5)","v":{"$error":"#VALUE!"}},{"$f":"HLOOKUP(A177,'Courbe In'!$AA$2:$CD$7,4)","v":{"$error":"#VALUE!"}},{"$f":"HLOOKUP(A177,'Courbe In'!$AA$2:$CD$7,6)","v":{"$error":"#VALUE!"}},{"$f":"HLOOKUP(A177,'Courbe In'!$AA$2:$CD$8,7)","v":{"$error":"#VALUE!"}},{"$f":"HLOOKUP(A177,'Courbe In'!$AA$2:$CD$9,8)","v":{"$error":"#VALUE!"}}]
["2021-07-12",null,{"$f":"HLOOKUP(A178,'Courbe In'!$AA$2:$CD$3,2)","v":{"$error":"#VALUE!"}},{"$f":"HLOOKUP(A178,'Courbe In'!$AA$2:$CD$7,5)","v":{"$error":"#VALUE!"}},{"$f":"HLOOKUP(A178,'Courbe In'!$AA$2:$CD$7,4)","v":{"$error":"#VALUE!"}},{"$f":"HLOOKUP(A178,'Courbe In'!$AA$2:$CD$7,6)","v":{"$error":"#VALUE!"}},{"$f":"HLOOKUP(A178,'Courbe In'!$AA$2:$CD$8,7)","v":{"$error":"#VALUE!"}},{"$f":"HLOOKUP(A178,'Courbe In'!$AA$2:$CD$9,8)","v":{"$error":"#VALUE!"}}]
["2021-07-13",null,{"$f":"HLOOKUP(A179,'Courbe In'!$AA$2:$CD$3,2)","v":{"$error":"#VALUE!"}},{"$f":"HLOOKUP(A179,'Courbe In'!$AA$2:$CD$7,5)","v":{"$error":"#VALUE!"}},{"$f":"HLOOKUP(A179,'Courbe In'!$AA$2:$CD$7,4)","v":{"$error":"#VALUE!"}},{"$f":"HLOOKUP(A179,'Courbe In'!$AA$2:$CD$7,6)","v":{"$error":"#VALUE!"}},{"$f":"HLOOKUP(A179,'Courbe In'!$AA$2:$CD$8,7)","v":{"$error":"#VALUE!"}},{"$f":"HLOOKUP(A179,'Courbe In'!$AA$2:$CD$9,8)","v":{"$error":"#VALUE!"}}]
["2021-07-14",null,{"$f":"HLOOKUP(A180,'Courbe In'!$AA$2:$CD$3,2)","v":{"$error":"#VALUE!"}},{"$f":"HLOOKUP(A180,'Courbe In'!$AA$2:$CD$7,5)","v":{"$error":"#VALUE!"}},{"$f":"HLOOKUP(A180,'Courbe In'!$AA$2:$CD$7,4)","v":{"$error":"#VALUE!"}},{"$f":"HLOOKUP(A180,'Courbe In'!$AA$2:$CD$7,6)","v":{"$error":"#VALUE!"}},{"$f":"HLOOKUP(A180,'Courbe In'!$AA$2:$CD$8,7)","v":{"$error":"#VALUE!"}},{"$f":"HLOOKUP(A180,'Courbe In'!$AA$2:$CD$9,8)","v":{"$error":"#VALUE!"}}]
["2021-07-15",null,{"$f":"HLOOKUP(A181,'Courbe In'!$AA$2:$CD$3,2)","v":{"$error":"#VALUE!"}},{"$f":"HLOOKUP(A181,'Courbe In'!$AA$2:$CD$7,5)","v":{"$error":"#VALUE!"}},{"$f":"HLOOKUP(A181,'Courbe In'!$AA$2:$CD$7,4)","v":{"$error":"#VALUE!"}},{"$f":"HLOOKUP(A181,'Courbe In'!$AA$2:$CD$7,6)","v":{"$error":"#VALUE!"}},{"$f":"HLOOKUP(A181,'Courbe In'!$AA$2:$CD$8,7)","v":{"$error":"#VALUE!"}},{"$f":"HLOOKUP(A181,'Courbe In'!$AA$2:$CD$9,8)","v":{"$error":"#VALUE!"}}]
["2021-07-16",null,{"$f":"HLOOKUP(A182,'Courbe In'!$AA$2:$CD$3,2)","v":{"$error":"#VALUE!"}},{"$f":"HLOOKUP(A182,'Courbe In'!$AA$2:$CD$7,5)","v":{"$error":"#VALUE!"}},{"$f":"HLOOKUP(A182,'Courbe In'!$AA$2:$CD$7,4)","v":{"$error":"#VALUE!"}},{"$f":"HLOOKUP(A182,'Courbe In'!$AA$2:$CD$7,6)","v":{"$error":"#VALUE!"}},{"$f":"HLOOKUP(A182,'Courbe In'!$AA$2:$CD$8,7)","v":{"$error":"#VALUE!"}},{"$f":"HLOOKUP(A182,'Courbe In'!$AA$2:$CD$9,8)","v":{"$error":"#VALUE!"}}]
["2021-07-17",null,{"$f":"HLOOKUP(A183,'Courbe In'!$AA$2:$CD$3,2)","v":{"$error":"#VALUE!"}},{"$f":"HLOOKUP(A183,'Courbe In'!$AA$2:$CD$7,5)","v":{"$error":"#VALUE!"}},{"$f":"HLOOKUP(A183,'Courbe In'!$AA$2:$CD$7,4)","v":{"$error":"#VALUE!"}},{"$f":"HLOOKUP(A183,'Courbe In'!$AA$2:$CD$7,6)","v":{"$error":"#VALUE!"}},{"$f":"HLOOKUP(A183,'Courbe In'!$AA$2:$CD$8,7)","v":{"$error":"#VALUE!"}},{"$f":"HLOOKUP(A183,'Courbe In'!$AA$2:$CD$9,8)","v":{"$error":"#VALUE!"}}]
["2021-07-18",null,{"$f":"HLOOKUP(A184,'Courbe In'!$AA$2:$CD$3,2)","v":{"$error":"#VALUE!"}},{"$f":"HLOOKUP(A184,'Courbe In'!$AA$2:$CD$7,5)","v":{"$error":"#VALUE!"}},{"$f":"HLOOKUP(A184,'Courbe In'!$AA$2:$CD$7,4)","v":{"$error":"#VALUE!"}},{"$f":"HLOOKUP(A184,'Courbe In'!$AA$2:$CD$7,6)","v":{"$error":"#VALUE!"}},{"$f":"HLOOKUP(A184,'Courbe In'!$AA$2:$CD$8,7)","v":{"$error":"#VALUE!"}},{"$f":"HLOOKUP(A184,'Courbe In'!$AA$2:$CD$9,8)","v":{"$error":"#VALUE!"}}]
["2021-07-19",null,{"$f":"HLOOKUP(A185,'Courbe In'!$AA$2:$CD$3,2)","v":{"$error":"#VALUE!"}},{"$f":"HLOOKUP(A185,'Courbe In'!$AA$2:$CD$7,5)","v":{"$error":"#VALUE!"}},{"$f":"HLOOKUP(A185,'Courbe In'!$AA$2:$CD$7,4)","v":{"$error":"#VALUE!"}},{"$f":"HLOOKUP(A185,'Courbe In'!$AA$2:$CD$7,6)","v":{"$error":"#VALUE!"}},{"$f":"HLOOKUP(A185,'Courbe In'!$AA$2:$CD$8,7)","v":{"$error":"#VALUE!"}},{"$f":"HLOOKUP(A185,'Courbe In'!$AA$2:$CD$9,8)","v":{"$error":"#VALUE!"}}]
["2021-07-20",null,{"$f":"HLOOKUP(A186,'Courbe In'!$AA$2:$CD$3,2)","v":{"$error":"#VALUE!"}},{"$f":"HLOOKUP(A186,'Courbe In'!$AA$2:$CD$7,5)","v":{"$error":"#VALUE!"}},{"$f":"HLOOKUP(A186,'Courbe In'!$AA$2:$CD$7,4)","v":{"$error":"#VALUE!"}},{"$f":"HLOOKUP(A186,'Courbe In'!$AA$2:$CD$7,6)","v":{"$error":"#VALUE!"}},{"$f":"HLOOKUP(A186,'Courbe In'!$AA$2:$CD$8,7)","v":{"$error":"#VALUE!"}},{"$f":"HLOOKUP(A186,'Courbe In'!$AA$2:$CD$9,8)","v":{"$error":"#VALUE!"}}]
["2021-07-21",null,{"$f":"HLOOKUP(A187,'Courbe In'!$AA$2:$CD$3,2)","v":{"$error":"#VALUE!"}},{"$f":"HLOOKUP(A187,'Courbe In'!$AA$2:$CD$7,5)","v":{"$error":"#VALUE!"}},{"$f":"HLOOKUP(A187,'Courbe In'!$AA$2:$CD$7,4)","v":{"$error":"#VALUE!"}},{"$f":"HLOOKUP(A187,'Courbe In'!$AA$2:$CD$7,6)","v":{"$error":"#VALUE!"}},{"$f":"HLOOKUP(A187,'Courbe In'!$AA$2:$CD$8,7)","v":{"$error":"#VALUE!"}},{"$f":"HLOOKUP(A187,'Courbe In'!$AA$2:$CD$9,8)","v":{"$error":"#VALUE!"}}]
["2021-07-22",null,{"$f":"HLOOKUP(A188,'Courbe In'!$AA$2:$CD$3,2)","v":{"$error":"#VALUE!"}},{"$f":"HLOOKUP(A188,'Courbe In'!$AA$2:$CD$7,5)","v":{"$error":"#VALUE!"}},{"$f":"HLOOKUP(A188,'Courbe In'!$AA$2:$CD$7,4)","v":{"$error":"#VALUE!"}},{"$f":"HLOOKUP(A188,'Courbe In'!$AA$2:$CD$7,6)","v":{"$error":"#VALUE!"}},{"$f":"HLOOKUP(A188,'Courbe In'!$AA$2:$CD$8,7)","v":{"$error":"#VALUE!"}},{"$f":"HLOOKUP(A188,'Courbe In'!$AA$2:$CD$9,8)","v":{"$error":"#VALUE!"}}]
["2021-07-23",null,{"$f":"HLOOKUP(A189,'Courbe In'!$AA$2:$CD$3,2)","v":{"$error":"#VALUE!"}},{"$f":"HLOOKUP(A189,'Courbe In'!$AA$2:$CD$7,5)","v":{"$error":"#VALUE!"}},{"$f":"HLOOKUP(A189,'Courbe In'!$AA$2:$CD$7,4)","v":{"$error":"#VALUE!"}},{"$f":"HLOOKUP(A189,'Courbe In'!$AA$2:$CD$7,6)","v":{"$error":"#VALUE!"}},{"$f":"HLOOKUP(A189,'Courbe In'!$AA$2:$CD$8,7)","v":{"$error":"#VALUE!"}},{"$f":"HLOOKUP(A189,'Courbe In'!$AA$2:$CD$9,8)","v":{"$error":"#VALUE!"}}]
["2021-07-24",null,{"$f":"HLOOKUP(A190,'Courbe In'!$AA$2:$CD$3,2)","v":{"$error":"#VALUE!"}},{"$f":"HLOOKUP(A190,'Courbe In'!$AA$2:$CD$7,5)","v":{"$error":"#VALUE!"}},{"$f":"HLOOKUP(A190,'Courbe In'!$AA$2:$CD$7,4)","v":{"$error":"#VALUE!"}},{"$f":"HLOOKUP(A190,'Courbe In'!$AA$2:$CD$7,6)","v":{"$error":"#VALUE!"}},{"$f":"HLOOKUP(A190,'Courbe In'!$AA$2:$CD$8,7)","v":{"$error":"#VALUE!"}},{"$f":"HLOOKUP(A190,'Courbe In'!$AA$2:$CD$9,8)","v":{"$error":"#VALUE!"}}]
["2021-07-25",null,{"$f":"HLOOKUP(A191,'Courbe In'!$AA$2:$CD$3,2)","v":{"$error":"#VALUE!"}},{"$f":"HLOOKUP(A191,'Courbe In'!$AA$2:$CD$7,5)","v":{"$error":"#VALUE!"}},{"$f":"HLOOKUP(A191,'Courbe In'!$AA$2:$CD$7,4)","v":{"$error":"#VALUE!"}},{"$f":"HLOOKUP(A191,'Courbe In'!$AA$2:$CD$7,6)","v":{"$error":"#VALUE!"}},{"$f":"HLOOKUP(A191,'Courbe In'!$AA$2:$CD$8,7)","v":{"$error":"#VALUE!"}},{"$f":"HLOOKUP(A191,'Courbe In'!$AA$2:$CD$9,8)","v":{"$error":"#VALUE!"}}]
["2021-07-26",null,{"$f":"HLOOKUP(A192,'Courbe In'!$AA$2:$CD$3,2)","v":{"$error":"#VALUE!"}},{"$f":"HLOOKUP(A192,'Courbe In'!$AA$2:$CD$7,5)","v":{"$error":"#VALUE!"}},{"$f":"HLOOKUP(A192,'Courbe In'!$AA$2:$CD$7,4)","v":{"$error":"#VALUE!"}},{"$f":"HLOOKUP(A192,'Courbe In'!$AA$2:$CD$7,6)","v":{"$error":"#VALUE!"}},{"$f":"HLOOKUP(A192,'Courbe In'!$AA$2:$CD$8,7)","v":{"$error":"#VALUE!"}},{"$f":"HLOOKUP(A192,'Courbe In'!$AA$2:$CD$9,8)","v":{"$error":"#VALUE!"}}]
["2021-07-27",null,{"$f":"HLOOKUP(A193,'Courbe In'!$AA$2:$CD$3,2)","v":{"$error":"#VALUE!"}},{"$f":"HLOOKUP(A193,'Courbe In'!$AA$2:$CD$7,5)","v":{"$error":"#VALUE!"}},{"$f":"HLOOKUP(A193,'Courbe In'!$AA$2:$CD$7,4)","v":{"$error":"#VALUE!"}},{"$f":"HLOOKUP(A193,'Courbe In'!$AA$2:$CD$7,6)","v":{"$error":"#VALUE!"}},{"$f":"HLOOKUP(A193,'Courbe In'!$AA$2:$CD$8,7)","v":{"$error":"#VALUE!"}},{"$f":"HLOOKUP(A193,'Courbe In'!$AA$2:$CD$9,8)","v":{"$error":"#VALUE!"}}]
["2021-07-28",null,{"$f":"HLOOKUP(A194,'Courbe In'!$AA$2:$CD$3,2)","v":{"$error":"#VALUE!"}},{"$f":"HLOOKUP(A194,'Courbe In'!$AA$2:$CD$7,5)","v":{"$error":"#VALUE!"}},{"$f":"HLOOKUP(A194,'Courbe In'!$AA$2:$CD$7,4)","v":{"$error":"#VALUE!"}},{"$f":"HLOOKUP(A194,'Courbe In'!$AA$2:$CD$7,6)","v":{"$error":"#VALUE!"}},{"$f":"HLOOKUP(A194,'Courbe In'!$AA$2:$CD$8,7)","v":{"$error":"#VALUE!"}},{"$f":"HLOOKUP(A194,'Courbe In'!$AA$2:$CD$9,8)","v":{"$error":"#VALUE!"}}]
["2021-07-29",null,{"$f":"HLOOKUP(A195,'Courbe In'!$AA$2:$CD$3,2)","v":{"$error":"#VALUE!"}},{"$f":"HLOOKUP(A195,'Courbe In'!$AA$2:$CD$7,5)","v":{"$error":"#VALUE!"}},{"$f":"HLOOKUP(A195,'Courbe In'!$AA$2:$CD$7,4)","v":{"$error":"#VALUE!"}},{"$f":"HLOOKUP(A195,'Courbe In'!$AA$2:$CD$7,6)","v":{"$error":"#VALUE!"}},{"$f":"HLOOKUP(A195,'Courbe In'!$AA$2:$CD$8,7)","v":{"$error":"#VALUE!"}},{"$f":"HLOOKUP(A195,'Courbe In'!$AA$2:$CD$9,8)","v":{"$error":"#VALUE!"}}]
[{"$f":"A195+1","v":"2021-07-30"},null,{"$f":"HLOOKUP(A196,'Courbe In'!$AA$2:$CD$3,2)","v":{"$error":"#VALUE!"}},{"$f":"HLOOKUP(A196,'Courbe In'!$AA$2:$CD$7,5)","v":{"$error":"#VALUE!"}},{"$f":"HLOOKUP(A196,'Courbe In'!$AA$2:$CD$7,4)","v":{"$error":"#VALUE!"}},{"$f":"HLOOKUP(A196,'Courbe In'!$AA$2:$CD$7,6)","v":{"$error":"#VALUE!"}},{"$f":"HLOOKUP(A196,'Courbe In'!$AA$2:$CD$8,7)","v":{"$error":"#VALUE!"}},{"$f":"HLOOKUP(A196,'Courbe In'!$AA$2:$CD$9,8)","v":{"$error":"#VALUE!"}}]
["2021-07-31",null,{"$f":"HLOOKUP(A197,'Courbe In'!$AA$2:$CD$3,2)","v":{"$error":"#VALUE!"}},{"$f":"HLOOKUP(A197,'Courbe In'!$AA$2:$CD$7,5)","v":{"$error":"#VALUE!"}},{"$f":"HLOOKUP(A197,'Courbe In'!$AA$2:$CD$7,4)","v":{"$error":"#VALUE!"}},{"$f":"HLOOKUP(A197,'Courbe In'!$AA$2:$CD$7,6)","v":{"$error":"#VALUE!"}},{"$f":"HLOOKUP(A197,'Courbe In'!$AA$2:$CD$8,7)","v":{"$error":"#VALUE!"}},{"$f":"HLOOKUP(A197,'Courbe In'!$AA$2:$CD$9,8)","v":{"$error":"#VALUE!"}}]
["2021-08-01",null,{"$f":"HLOOKUP(A198,'Courbe In'!$AA$2:$CD$3,2)","v":{"$error":"#VALUE!"}},{"$f":"HLOOKUP(A198,'Courbe In'!$AA$2:$CD$7,5)","v":{"$error":"#VALUE!"}},{"$f":"HLOOKUP(A198,'Courbe In'!$AA$2:$CD$7,4)","v":{"$error":"#VALUE!"}},{"$f":"HLOOKUP(A198,'Courbe In'!$AA$2:$CD$7,6)","v":{"$error":"#VALUE!"}},{"$f":"HLOOKUP(A198,'Courbe In'!$AA$2:$CD$8,7)","v":{"$error":"#VALUE!"}},{"$f":"HLOOKUP(A198,'Courbe In'!$AA$2:$CD$9,8)","v":{"$error":"#VALUE!"}}]
["2021-08-02",null,{"$f":"HLOOKUP(A199,'Courbe In'!$AA$2:$CD$3,2)","v":{"$error":"#VALUE!"}},{"$f":"HLOOKUP(A199,'Courbe In'!$AA$2:$CD$7,5)","v":{"$error":"#VALUE!"}},{"$f":"HLOOKUP(A199,'Courbe In'!$AA$2:$CD$7,4)","v":{"$error":"#VALUE!"}},{"$f":"HLOOKUP(A199,'Courbe In'!$AA$2:$CD$7,6)","v":{"$error":"#VALUE!"}},{"$f":"HLOOKUP(A199,'Courbe In'!$AA$2:$CD$8,7)","v":{"$error":"#VALUE!"}},{"$f":"HLOOKUP(A199,'Courbe In'!$AA$2:$CD$9,8)","v":{"$error":"#VALUE!"}}]
["2021-08-03",null,{"$f":"HLOOKUP(A200,'Courbe In'!$AA$2:$CD$3,2)","v":{"$error":"#VALUE!"}},{"$f":"HLOOKUP(A200,'Courbe In'!$AA$2:$CD$7,5)","v":{"$error":"#VALUE!"}},{"$f":"HLOOKUP(A200,'Courbe In'!$AA$2:$CD$7,4)","v":{"$error":"#VALUE!"}},{"$f":"HLOOKUP(A200,'Courbe In'!$AA$2:$CD$7,6)","v":{"$error":"#VALUE!"}},{"$f":"HLOOKUP(A200,'Courbe In'!$AA$2:$CD$8,7)","v":{"$error":"#VALUE!"}},{"$f":"HLOOKUP(A200,'Courbe In'!$AA$2:$CD$9,8)","v":{"$error":"#VALUE!"}}]
["2021-08-04",null,{"$f":"HLOOKUP(A201,'Courbe In'!$AA$2:$CD$3,2)","v":{"$error":"#VALUE!"}},{"$f":"HLOOKUP(A201,'Courbe In'!$AA$2:$CD$7,5)","v":{"$error":"#VALUE!"}},{"$f":"HLOOKUP(A201,'Courbe In'!$AA$2:$CD$7,4)","v":{"$error":"#VALUE!"}},{"$f":"HLOOKUP(A201,'Courbe In'!$AA$2:$CD$7,6)","v":{"$error":"#VALUE!"}},{"$f":"HLOOKUP(A201,'Courbe In'!$AA$2:$CD$8,7)","v":{"$error":"#VALUE!"}},{"$f":"HLOOKUP(A201,'Courbe In'!$AA$2:$CD$9,8)","v":{"$error":"#VALUE!"}}]
["2021-08-05",null,{"$f":"HLOOKUP(A202,'Courbe In'!$AA$2:$CD$3,2)","v":{"$error":"#VALUE!"}},{"$f":"HLOOKUP(A202,'Courbe In'!$AA$2:$CD$7,5)","v":{"$error":"#VALUE!"}},{"$f":"HLOOKUP(A202,'Courbe In'!$AA$2:$CD$7,4)","v":{"$error":"#VALUE!"}},{"$f":"HLOOKUP(A202,'Courbe In'!$AA$2:$CD$7,6)","v":{"$error":"#VALUE!"}},{"$f":"HLOOKUP(A202,'Courbe In'!$AA$2:$CD$8,7)","v":{"$error":"#VALUE!"}},{"$f":"HLOOKUP(A202,'Courbe In'!$AA$2:$CD$9,8)","v":{"$error":"#VALUE!"}}]
["2021-08-06",null,{"$f":"HLOOKUP(A203,'Courbe In'!$AA$2:$CD$3,2)","v":{"$error":"#VALUE!"}},{"$f":"HLOOKUP(A203,'Courbe In'!$AA$2:$CD$7,5)","v":{"$error":"#VALUE!"}},{"$f":"HLOOKUP(A203,'Courbe In'!$AA$2:$CD$7,4)","v":{"$error":"#VALUE!"}},{"$f":"HLOOKUP(A203,'Courbe In'!$AA$2:$CD$7,6)","v":{"$error":"#VALUE!"}},{"$f":"HLOOKUP(A203,'Courbe In'!$AA$2:$CD$8,7)","v":{"$error":"#VALUE!"}},{"$f":"HLOOKUP(A203,'Courbe In'!$AA$2:$CD$9,8)","v":{"$error":"#VALUE!"}}]
["2021-08-07",null,{"$f":"HLOOKUP(A204,'Courbe In'!$AA$2:$CD$3,2)","v":{"$error":"#VALUE!"}},{"$f":"HLOOKUP(A204,'Courbe In'!$AA$2:$CD$7,5)","v":{"$error":"#VALUE!"}},{"$f":"HLOOKUP(A204,'Courbe In'!$AA$2:$CD$7,4)","v":{"$error":"#VALUE!"}},{"$f":"HLOOKUP(A204,'Courbe In'!$AA$2:$CD$7,6)","v":{"$error":"#VALUE!"}},{"$f":"HLOOKUP(A204,'Courbe In'!$AA$2:$CD$8,7)","v":{"$error":"#VALUE!"}},{"$f":"HLOOKUP(A204,'Courbe In'!$AA$2:$CD$9,8)","v":{"$error":"#VALUE!"}}]
["2021-08-08",null,{"$f":"HLOOKUP(A205,'Courbe In'!$AA$2:$CD$3,2)","v":{"$error":"#VALUE!"}},{"$f":"HLOOKUP(A205,'Courbe In'!$AA$2:$CD$7,5)","v":{"$error":"#VALUE!"}},{"$f":"HLOOKUP(A205,'Courbe In'!$AA$2:$CD$7,4)","v":{"$error":"#VALUE!"}},{"$f":"HLOOKUP(A205,'Courbe In'!$AA$2:$CD$7,6)","v":{"$error":"#VALUE!"}},{"$f":"HLOOKUP(A205,'Courbe In'!$AA$2:$CD$8,7)","v":{"$error":"#VALUE!"}},{"$f":"HLOOKUP(A205,'Courbe In'!$AA$2:$CD$9,8)","v":{"$error":"#VALUE!"}}]
["2021-08-09",null,{"$f":"HLOOKUP(A206,'Courbe In'!$AA$2:$CD$3,2)","v":{"$error":"#VALUE!"}},{"$f":"HLOOKUP(A206,'Courbe In'!$AA$2:$CD$7,5)","v":{"$error":"#VALUE!"}},{"$f":"HLOOKUP(A206,'Courbe In'!$AA$2:$CD$7,4)","v":{"$error":"#VALUE!"}},{"$f":"HLOOKUP(A206,'Courbe In'!$AA$2:$CD$7,6)","v":{"$error":"#VALUE!"}},{"$f":"HLOOKUP(A206,'Courbe In'!$AA$2:$CD$8,7)","v":{"$error":"#VALUE!"}},{"$f":"HLOOKUP(A206,'Courbe In'!$AA$2:$CD$9,8)","v":{"$error":"#VALUE!"}}]
["2021-08-10",null,{"$f":"HLOOKUP(A207,'Courbe In'!$AA$2:$CD$3,2)","v":{"$error":"#VALUE!"}},{"$f":"HLOOKUP(A207,'Courbe In'!$AA$2:$CD$7,5)","v":{"$error":"#VALUE!"}},{"$f":"HLOOKUP(A207,'Courbe In'!$AA$2:$CD$7,4)","v":{"$error":"#VALUE!"}},{"$f":"HLOOKUP(A207,'Courbe In'!$AA$2:$CD$7,6)","v":{"$error":"#VALUE!"}},{"$f":"HLOOKUP(A207,'Courbe In'!$AA$2:$CD$8,7)","v":{"$error":"#VALUE!"}},{"$f":"HLOOKUP(A207,'Courbe In'!$AA$2:$CD$9,8)","v":{"$error":"#VALUE!"}}]
["2021-08-11",null,{"$f":"HLOOKUP(A208,'Courbe In'!$AA$2:$CD$3,2)","v":{"$error":"#VALUE!"}},{"$f":"HLOOKUP(A208,'Courbe In'!$AA$2:$CD$7,5)","v":{"$error":"#VALUE!"}},{"$f":"HLOOKUP(A208,'Courbe In'!$AA$2:$CD$7,4)","v":{"$error":"#VALUE!"}},{"$f":"HLOOKUP(A208,'Courbe In'!$AA$2:$CD$7,6)","v":{"$error":"#VALUE!"}},{"$f":"HLOOKUP(A208,'Courbe In'!$AA$2:$CD$8,7)","v":{"$error":"#VALUE!"}},{"$f":"HLOOKUP(A208,'Courbe In'!$AA$2:$CD$9,8)","v":{"$error":"#VALUE!"}}]
["2021-08-12",null,{"$f":"HLOOKUP(A209,'Courbe In'!$AA$2:$CD$3,2)","v":{"$error":"#VALUE!"}},{"$f":"HLOOKUP(A209,'Courbe In'!$AA$2:$CD$7,5)","v":{"$error":"#VALUE!"}},{"$f":"HLOOKUP(A209,'Courbe In'!$AA$2:$CD$7,4)","v":{"$error":"#VALUE!"}},{"$f":"HLOOKUP(A209,'Courbe In'!$AA$2:$CD$7,6)","v":{"$error":"#VALUE!"}},{"$f":"HLOOKUP(A209,'Courbe In'!$AA$2:$CD$8,7)","v":{"$error":"#VALUE!"}},{"$f":"HLOOKUP(A209,'Courbe In'!$AA$2:$CD$9,8)","v":{"$error":"#VALUE!"}}]
["2021-08-13",null,{"$f":"HLOOKUP(A210,'Courbe In'!$AA$2:$CD$3,2)","v":{"$error":"#VALUE!"}},{"$f":"HLOOKUP(A210,'Courbe In'!$AA$2:$CD$7,5)","v":{"$error":"#VALUE!"}},{"$f":"HLOOKUP(A210,'Courbe In'!$AA$2:$CD$7,4)","v":{"$error":"#VALUE!"}},{"$f":"HLOOKUP(A210,'Courbe In'!$AA$2:$CD$7,6)","v":{"$error":"#VALUE!"}},{"$f":"HLOOKUP(A210,'Courbe In'!$AA$2:$CD$8,7)","v":{"$error":"#VALUE!"}},{"$f":"HLOOKUP(A210,'Courbe In'!$AA$2:$CD$9,8)","v":{"$error":"#VALUE!"}}]
["2021-08-14",null,{"$f":"HLOOKUP(A211,'Courbe In'!$AA$2:$CD$3,2)","v":{"$error":"#VALUE!"}},{"$f":"HLOOKUP(A211,'Courbe In'!$AA$2:$CD$7,5)","v":{"$error":"#VALUE!"}},{"$f":"HLOOKUP(A211,'Courbe In'!$AA$2:$CD$7,4)","v":{"$error":"#VALUE!"}},{"$f":"HLOOKUP(A211,'Courbe In'!$AA$2:$CD$7,6)","v":{"$error":"#VALUE!"}},{"$f":"HLOOKUP(A211,'Courbe In'!$AA$2:$CD$8,7)","v":{"$error":"#VALUE!"}},{"$f":"HLOOKUP(A211,'Courbe In'!$AA$2:$CD$9,8)","v":{"$error":"#VALUE!"}}]
["2021-08-15",null,{"$f":"HLOOKUP(A212,'Courbe In'!$AA$2:$CD$3,2)","v":{"$error":"#VALUE!"}},{"$f":"HLOOKUP(A212,'Courbe In'!$AA$2:$CD$7,5)","v":{"$error":"#VALUE!"}},{"$f":"HLOOKUP(A212,'Courbe In'!$AA$2:$CD$7,4)","v":{"$error":"#VALUE!"}},{"$f":"HLOOKUP(A212,'Courbe In'!$AA$2:$CD$7,6)","v":{"$error":"#VALUE!"}},{"$f":"HLOOKUP(A212,'Courbe In'!$AA$2:$CD$8,7)","v":{"$error":"#VALUE!"}},{"$f":"HLOOKUP(A212,'Courbe In'!$AA$2:$CD$9,8)","v":{"$error":"#VALUE!"}}]
["2021-08-16",null,{"$f":"HLOOKUP(A213,'Courbe In'!$AA$2:$CD$3,2)","v":{"$error":"#VALUE!"}},{"$f":"HLOOKUP(A213,'Courbe In'!$AA$2:$CD$7,5)","v":{"$error":"#VALUE!"}},{"$f":"HLOOKUP(A213,'Courbe In'!$AA$2:$CD$7,4)","v":{"$error":"#VALUE!"}},{"$f":"HLOOKUP(A213,'Courbe In'!$AA$2:$CD$7,6)","v":{"$error":"#VALUE!"}},{"$f":"HLOOKUP(A213,'Courbe In'!$AA$2:$CD$8,7)","v":{"$error":"#VALUE!"}},{"$f":"HLOOKUP(A213,'Courbe In'!$AA$2:$CD$9,8)","v":{"$error":"#VALUE!"}}]
["2021-08-17",null,{"$f":"HLOOKUP(A214,'Courbe In'!$AA$2:$CD$3,2)","v":{"$error":"#VALUE!"}},{"$f":"HLOOKUP(A214,'Courbe In'!$AA$2:$CD$7,5)","v":{"$error":"#VALUE!"}},{"$f":"HLOOKUP(A214,'Courbe In'!$AA$2:$CD$7,4)","v":{"$error":"#VALUE!"}},{"$f":"HLOOKUP(A214,'Courbe In'!$AA$2:$CD$7,6)","v":{"$error":"#VALUE!"}},{"$f":"HLOOKUP(A214,'Courbe In'!$AA$2:$CD$8,7)","v":{"$error":"#VALUE!"}},{"$f":"HLOOKUP(A214,'Courbe In'!$AA$2:$CD$9,8)","v":{"$error":"#VALUE!"}}]
["2021-08-18",null,{"$f":"HLOOKUP(A215,'Courbe In'!$AA$2:$CD$3,2)","v":{"$error":"#VALUE!"}},{"$f":"HLOOKUP(A215,'Courbe In'!$AA$2:$CD$7,5)","v":{"$error":"#VALUE!"}},{"$f":"HLOOKUP(A215,'Courbe In'!$AA$2:$CD$7,4)","v":{"$error":"#VALUE!"}},{"$f":"HLOOKUP(A215,'Courbe In'!$AA$2:$CD$7,6)","v":{"$error":"#VALUE!"}},{"$f":"HLOOKUP(A215,'Courbe In'!$AA$2:$CD$8,7)","v":{"$error":"#VALUE!"}},{"$f":"HLOOKUP(A215,'Courbe In'!$AA$2:$CD$9,8)","v":{"$error":"#VALUE!"}}]
["2021-08-19",null,{"$f":"HLOOKUP(A216,'Courbe In'!$AA$2:$CD$3,2)","v":{"$error":"#VALUE!"}},{"$f":"HLOOKUP(A216,'Courbe In'!$AA$2:$CD$7,5)","v":{"$error":"#VALUE!"}},{"$f":"HLOOKUP(A216,'Courbe In'!$AA$2:$CD$7,4)","v":{"$error":"#VALUE!"}},{"$f":"HLOOKUP(A216,'Courbe In'!$AA$2:$CD$7,6)","v":{"$error":"#VALUE!"}},{"$f":"HLOOKUP(A216,'Courbe In'!$AA$2:$CD$8,7)","v":{"$error":"#VALUE!"}},{"$f":"HLOOKUP(A216,'Courbe In'!$AA$2:$CD$9,8)","v":{"$error":"#VALUE!"}}]
["2021-08-20",null,{"$f":"HLOOKUP(A217,'Courbe In'!$AA$2:$CD$3,2)","v":{"$error":"#VALUE!"}},{"$f":"HLOOKUP(A217,'Courbe In'!$AA$2:$CD$7,5)","v":{"$error":"#VALUE!"}},{"$f":"HLOOKUP(A217,'Courbe In'!$AA$2:$CD$7,4)","v":{"$error":"#VALUE!"}},{"$f":"HLOOKUP(A217,'Courbe In'!$AA$2:$CD$7,6)","v":{"$error":"#VALUE!"}},{"$f":"HLOOKUP(A217,'Courbe In'!$AA$2:$CD$8,7)","v":{"$error":"#VALUE!"}},{"$f":"HLOOKUP(A217,'Courbe In'!$AA$2:$CD$9,8)","v":{"$error":"#VALUE!"}}]
["2021-08-21",null,{"$f":"HLOOKUP(A218,'Courbe In'!$AA$2:$CD$3,2)","v":{"$error":"#VALUE!"}},{"$f":"HLOOKUP(A218,'Courbe In'!$AA$2:$CD$7,5)","v":{"$error":"#VALUE!"}},{"$f":"HLOOKUP(A218,'Courbe In'!$AA$2:$CD$7,4)","v":{"$error":"#VALUE!"}},{"$f":"HLOOKUP(A218,'Courbe In'!$AA$2:$CD$7,6)","v":{"$error":"#VALUE!"}},{"$f":"HLOOKUP(A218,'Courbe In'!$AA$2:$CD$8,7)","v":{"$error":"#VALUE!"}},{"$f":"HLOOKUP(A218,'Courbe In'!$AA$2:$CD$9,8)","v":{"$error":"#VALUE!"}}]
["2021-08-22",null,{"$f":"HLOOKUP(A219,'Courbe In'!$AA$2:$CD$3,2)","v":{"$error":"#VALUE!"}},{"$f":"HLOOKUP(A219,'Courbe In'!$AA$2:$CD$7,5)","v":{"$error":"#VALUE!"}},{"$f":"HLOOKUP(A219,'Courbe In'!$AA$2:$CD$7,4)","v":{"$error":"#VALUE!"}},{"$f":"HLOOKUP(A219,'Courbe In'!$AA$2:$CD$7,6)","v":{"$error":"#VALUE!"}},{"$f":"HLOOKUP(A219,'Courbe In'!$AA$2:$CD$8,7)","v":{"$error":"#VALUE!"}},{"$f":"HLOOKUP(A219,'Courbe In'!$AA$2:$CD$9,8)","v":{"$error":"#VALUE!"}}]
["2021-08-23",null,{"$f":"HLOOKUP(A220,'Courbe In'!$AA$2:$CD$3,2)","v":{"$error":"#VALUE!"}},{"$f":"HLOOKUP(A220,'Courbe In'!$AA$2:$CD$7,5)","v":{"$error":"#VALUE!"}},{"$f":"HLOOKUP(A220,'Courbe In'!$AA$2:$CD$7,4)","v":{"$error":"#VALUE!"}},{"$f":"HLOOKUP(A220,'Courbe In'!$AA$2:$CD$7,6)","v":{"$error":"#VALUE!"}},{"$f":"HLOOKUP(A220,'Courbe In'!$AA$2:$CD$8,7)","v":{"$error":"#VALUE!"}},{"$f":"HLOOKUP(A220,'Courbe In'!$AA$2:$CD$9,8)","v":{"$error":"#VALUE!"}}]
["2021-08-24",null,{"$f":"HLOOKUP(A221,'Courbe In'!$AA$2:$CD$3,2)","v":{"$error":"#VALUE!"}},{"$f":"HLOOKUP(A221,'Courbe In'!$AA$2:$CD$7,5)","v":{"$error":"#VALUE!"}},{"$f":"HLOOKUP(A221,'Courbe In'!$AA$2:$CD$7,4)","v":{"$error":"#VALUE!"}},{"$f":"HLOOKUP(A221,'Courbe In'!$AA$2:$CD$7,6)","v":{"$error":"#VALUE!"}},{"$f":"HLOOKUP(A221,'Courbe In'!$AA$2:$CD$8,7)","v":{"$error":"#VALUE!"}},{"$f":"HLOOKUP(A221,'Courbe In'!$AA$2:$CD$9,8)","v":{"$error":"#VALUE!"}}]
["2021-08-25",null,{"$f":"HLOOKUP(A222,'Courbe In'!$AA$2:$CD$3,2)","v":{"$error":"#VALUE!"}},{"$f":"HLOOKUP(A222,'Courbe In'!$AA$2:$CD$7,5)","v":{"$error":"#VALUE!"}},{"$f":"HLOOKUP(A222,'Courbe In'!$AA$2:$CD$7,4)","v":{"$error":"#VALUE!"}},{"$f":"HLOOKUP(A222,'Courbe In'!$AA$2:$CD$7,6)","v":{"$error":"#VALUE!"}},{"$f":"HLOOKUP(A222,'Courbe In'!$AA$2:$CD$8,7)","v":{"$error":"#VALUE!"}},{"$f":"HLOOKUP(A222,'Courbe In'!$AA$2:$CD$9,8)","v":{"$error":"#VALUE!"}}]
["2021-08-26",null,{"$f":"HLOOKUP(A223,'Courbe In'!$AA$2:$CD$3,2)","v":{"$error":"#VALUE!"}},{"$f":"HLOOKUP(A223,'Courbe In'!$AA$2:$CD$7,5)","v":{"$error":"#VALUE!"}},{"$f":"HLOOKUP(A223,'Courbe In'!$AA$2:$CD$7,4)","v":{"$error":"#VALUE!"}},{"$f":"HLOOKUP(A223,'Courbe In'!$AA$2:$CD$7,6)","v":{"$error":"#VALUE!"}},{"$f":"HLOOKUP(A223,'Courbe In'!$AA$2:$CD$8,7)","v":{"$error":"#VALUE!"}},{"$f":"HLOOKUP(A223,'Courbe In'!$AA$2:$CD$9,8)","v":{"$error":"#VALUE!"}}]
["2021-08-27",null,{"$f":"HLOOKUP(A224,'Courbe In'!$AA$2:$CD$3,2)","v":{"$error":"#VALUE!"}},{"$f":"HLOOKUP(A224,'Courbe In'!$AA$2:$CD$7,5)","v":{"$error":"#VALUE!"}},{"$f":"HLOOKUP(A224,'Courbe In'!$AA$2:$CD$7,4)","v":{"$error":"#VALUE!"}},{"$f":"HLOOKUP(A224,'Courbe In'!$AA$2:$CD$7,6)","v":{"$error":"#VALUE!"}},{"$f":"HLOOKUP(A224,'Courbe In'!$AA$2:$CD$8,7)","v":{"$error":"#VALUE!"}},{"$f":"HLOOKUP(A224,'Courbe In'!$AA$2:$CD$9,8)","v":{"$error":"#VALUE!"}}]
["2021-08-28",null,{"$f":"HLOOKUP(A225,'Courbe In'!$AA$2:$CD$3,2)","v":{"$error":"#VALUE!"}},{"$f":"HLOOKUP(A225,'Courbe In'!$AA$2:$CD$7,5)","v":{"$error":"#VALUE!"}},{"$f":"HLOOKUP(A225,'Courbe In'!$AA$2:$CD$7,4)","v":{"$error":"#VALUE!"}},{"$f":"HLOOKUP(A225,'Courbe In'!$AA$2:$CD$7,6)","v":{"$error":"#VALUE!"}},{"$f":"HLOOKUP(A225,'Courbe In'!$AA$2:$CD$8,7)","v":{"$error":"#VALUE!"}},{"$f":"HLOOKUP(A225,'Courbe In'!$AA$2:$CD$9,8)","v":{"$error":"#VALUE!"}}]
["2021-08-29",null,{"$f":"HLOOKUP(A226,'Courbe In'!$AA$2:$CD$3,2)","v":{"$error":"#VALUE!"}},{"$f":"HLOOKUP(A226,'Courbe In'!$AA$2:$CD$7,5)","v":{"$error":"#VALUE!"}},{"$f":"HLOOKUP(A226,'Courbe In'!$AA$2:$CD$7,4)","v":{"$error":"#VALUE!"}},{"$f":"HLOOKUP(A226,'Courbe In'!$AA$2:$CD$7,6)","v":{"$error":"#VALUE!"}},{"$f":"HLOOKUP(A226,'Courbe In'!$AA$2:$CD$8,7)","v":{"$error":"#VALUE!"}},{"$f":"HLOOKUP(A226,'Courbe In'!$AA$2:$CD$9,8)","v":{"$error":"#VALUE!"}}]
["2021-08-30",null,{"$f":"HLOOKUP(A227,'Courbe In'!$AA$2:$CD$3,2)","v":{"$error":"#VALUE!"}},{"$f":"HLOOKUP(A227,'Courbe In'!$AA$2:$CD$7,5)","v":{"$error":"#VALUE!"}},{"$f":"HLOOKUP(A227,'Courbe In'!$AA$2:$CD$7,4)","v":{"$error":"#VALUE!"}},{"$f":"HLOOKUP(A227,'Courbe In'!$AA$2:$CD$7,6)","v":{"$error":"#VALUE!"}},{"$f":"HLOOKUP(A227,'Courbe In'!$AA$2:$CD$8,7)","v":{"$error":"#VALUE!"}},{"$f":"HLOOKUP(A227,'Courbe In'!$AA$2:$CD$9,8)","v":{"$error":"#VALUE!"}}]
["2021-08-31",null,{"$f":"HLOOKUP(A228,'Courbe In'!$AA$2:$CD$3,2)","v":{"$error":"#VALUE!"}},{"$f":"HLOOKUP(A228,'Courbe In'!$AA$2:$CD$7,5)","v":{"$error":"#VALUE!"}},{"$f":"HLOOKUP(A228,'Courbe In'!$AA$2:$CD$7,4)","v":{"$error":"#VALUE!"}},{"$f":"HLOOKUP(A228,'Courbe In'!$AA$2:$CD$7,6)","v":{"$error":"#VALUE!"}},{"$f":"HLOOKUP(A228,'Courbe In'!$AA$2:$CD$8,7)","v":{"$error":"#VALUE!"}},{"$f":"HLOOKUP(A228,'Courbe In'!$AA$2:$CD$9,8)","v":{"$error":"#VALUE!"}}]
["2021-09-01",null,{"$f":"HLOOKUP(A229,'Courbe In'!$AA$2:$CD$3,2)","v":{"$error":"#VALUE!"}},{"$f":"HLOOKUP(A229,'Courbe In'!$AA$2:$CD$7,5)","v":{"$error":"#VALUE!"}},{"$f":"HLOOKUP(A229,'Courbe In'!$AA$2:$CD$7,4)","v":{"$error":"#VALUE!"}},{"$f":"HLOOKUP(A229,'Courbe In'!$AA$2:$CD$7,6)","v":{"$error":"#VALUE!"}},{"$f":"HLOOKUP(A229,'Courbe In'!$AA$2:$CD$8,7)","v":{"$error":"#VALUE!"}},{"$f":"HLOOKUP(A229,'Courbe In'!$AA$2:$CD$9,8)","v":{"$error":"#VALUE!"}}]
["2021-09-02",null,{"$f":"HLOOKUP(A230,'Courbe In'!$AA$2:$CD$3,2)","v":{"$error":"#VALUE!"}},{"$f":"HLOOKUP(A230,'Courbe In'!$AA$2:$CD$7,5)","v":{"$error":"#VALUE!"}},{"$f":"HLOOKUP(A230,'Courbe In'!$AA$2:$CD$7,4)","v":{"$error":"#VALUE!"}},{"$f":"HLOOKUP(A230,'Courbe In'!$AA$2:$CD$7,6)","v":{"$error":"#VALUE!"}},{"$f":"HLOOKUP(A230,'Courbe In'!$AA$2:$CD$8,7)","v":{"$error":"#VALUE!"}},{"$f":"HLOOKUP(A230,'Courbe In'!$AA$2:$CD$9,8)","v":{"$error":"#VALUE!"}}]
["2021-09-03",null,{"$f":"HLOOKUP(A231,'Courbe In'!$AA$2:$CD$3,2)","v":{"$error":"#VALUE!"}},{"$f":"HLOOKUP(A231,'Courbe In'!$AA$2:$CD$7,5)","v":{"$error":"#VALUE!"}},{"$f":"HLOOKUP(A231,'Courbe In'!$AA$2:$CD$7,4)","v":{"$error":"#VALUE!"}},{"$f":"HLOOKUP(A231,'Courbe In'!$AA$2:$CD$7,6)","v":{"$error":"#VALUE!"}},{"$f":"HLOOKUP(A231,'Courbe In'!$AA$2:$CD$8,7)","v":{"$error":"#VALUE!"}},{"$f":"HLOOKUP(A231,'Courbe In'!$AA$2:$CD$9,8)","v":{"$error":"#VALUE!"}}]
["2021-09-04",null,{"$f":"HLOOKUP(A232,'Courbe In'!$AA$2:$CD$3,2)","v":{"$error":"#VALUE!"}},{"$f":"HLOOKUP(A232,'Courbe In'!$AA$2:$CD$7,5)","v":{"$error":"#VALUE!"}},{"$f":"HLOOKUP(A232,'Courbe In'!$AA$2:$CD$7,4)","v":{"$error":"#VALUE!"}},{"$f":"HLOOKUP(A232,'Courbe In'!$AA$2:$CD$7,6)","v":{"$error":"#VALUE!"}},{"$f":"HLOOKUP(A232,'Courbe In'!$AA$2:$CD$8,7)","v":{"$error":"#VALUE!"}},{"$f":"HLOOKUP(A232,'Courbe In'!$AA$2:$CD$9,8)","v":{"$error":"#VALUE!"}}]
["2021-09-05",null,{"$f":"HLOOKUP(A233,'Courbe In'!$AA$2:$CD$3,2)","v":{"$error":"#VALUE!"}},{"$f":"HLOOKUP(A233,'Courbe In'!$AA$2:$CD$7,5)","v":{"$error":"#VALUE!"}},{"$f":"HLOOKUP(A233,'Courbe In'!$AA$2:$CD$7,4)","v":{"$error":"#VALUE!"}},{"$f":"HLOOKUP(A233,'Courbe In'!$AA$2:$CD$7,6)","v":{"$error":"#VALUE!"}},{"$f":"HLOOKUP(A233,'Courbe In'!$AA$2:$CD$8,7)","v":{"$error":"#VALUE!"}},{"$f":"HLOOKUP(A233,'Courbe In'!$AA$2:$CD$9,8)","v":{"$error":"#VALUE!"}}]
["2021-09-06",null,{"$f":"HLOOKUP(A234,'Courbe In'!$AA$2:$CD$3,2)","v":{"$error":"#VALUE!"}},{"$f":"HLOOKUP(A234,'Courbe In'!$AA$2:$CD$7,5)","v":{"$error":"#VALUE!"}},{"$f":"HLOOKUP(A234,'Courbe In'!$AA$2:$CD$7,4)","v":{"$error":"#VALUE!"}},{"$f":"HLOOKUP(A234,'Courbe In'!$AA$2:$CD$7,6)","v":{"$error":"#VALUE!"}},{"$f":"HLOOKUP(A234,'Courbe In'!$AA$2:$CD$8,7)","v":{"$error":"#VALUE!"}},{"$f":"HLOOKUP(A234,'Courbe In'!$AA$2:$CD$9,8)","v":{"$error":"#VALUE!"}}]
["2021-09-07",null,{"$f":"HLOOKUP(A235,'Courbe In'!$AA$2:$CD$3,2)","v":{"$error":"#VALUE!"}},{"$f":"HLOOKUP(A235,'Courbe In'!$AA$2:$CD$7,5)","v":{"$error":"#VALUE!"}},{"$f":"HLOOKUP(A235,'Courbe In'!$AA$2:$CD$7,4)","v":{"$error":"#VALUE!"}},{"$f":"HLOOKUP(A235,'Courbe In'!$AA$2:$CD$7,6)","v":{"$error":"#VALUE!"}},{"$f":"HLOOKUP(A235,'Courbe In'!$AA$2:$CD$8,7)","v":{"$error":"#VALUE!"}},{"$f":"HLOOKUP(A235,'Courbe In'!$AA$2:$CD$9,8)","v":{"$error":"#VALUE!"}}]
["2021-09-08",null,{"$f":"HLOOKUP(A236,'Courbe In'!$AA$2:$CD$3,2)","v":{"$error":"#VALUE!"}},{"$f":"HLOOKUP(A236,'Courbe In'!$AA$2:$CD$7,5)","v":{"$error":"#VALUE!"}},{"$f":"HLOOKUP(A236,'Courbe In'!$AA$2:$CD$7,4)","v":{"$error":"#VALUE!"}},{"$f":"HLOOKUP(A236,'Courbe In'!$AA$2:$CD$7,6)","v":{"$error":"#VALUE!"}},{"$f":"HLOOKUP(A236,'Courbe In'!$AA$2:$CD$8,7)","v":{"$error":"#VALUE!"}},{"$f":"HLOOKUP(A236,'Courbe In'!$AA$2:$CD$9,8)","v":{"$error":"#VALUE!"}}]
["2021-09-09",null,{"$f":"HLOOKUP(A237,'Courbe In'!$AA$2:$CD$3,2)","v":{"$error":"#VALUE!"}},{"$f":"HLOOKUP(A237,'Courbe In'!$AA$2:$CD$7,5)","v":{"$error":"#VALUE!"}},{"$f":"HLOOKUP(A237,'Courbe In'!$AA$2:$CD$7,4)","v":{"$error":"#VALUE!"}},{"$f":"HLOOKUP(A237,'Courbe In'!$AA$2:$CD$7,6)","v":{"$error":"#VALUE!"}},{"$f":"HLOOKUP(A237,'Courbe In'!$AA$2:$CD$8,7)","v":{"$error":"#VALUE!"}},{"$f":"HLOOKUP(A237,'Courbe In'!$AA$2:$CD$9,8)","v":{"$error":"#VALUE!"}}]
["2021-09-10",null,{"$f":"HLOOKUP(A238,'Courbe In'!$AA$2:$CD$3,2)","v":{"$error":"#VALUE!"}},{"$f":"HLOOKUP(A238,'Courbe In'!$AA$2:$CD$7,5)","v":{"$error":"#VALUE!"}},{"$f":"HLOOKUP(A238,'Courbe In'!$AA$2:$CD$7,4)","v":{"$error":"#VALUE!"}},{"$f":"HLOOKUP(A238,'Courbe In'!$AA$2:$CD$7,6)","v":{"$error":"#VALUE!"}},{"$f":"HLOOKUP(A238,'Courbe In'!$AA$2:$CD$8,7)","v":{"$error":"#VALUE!"}},{"$f":"HLOOKUP(A238,'Courbe In'!$AA$2:$CD$9,8)","v":{"$error":"#VALUE!"}}]
["2021-09-11",null,{"$f":"HLOOKUP(A239,'Courbe In'!$AA$2:$CD$3,2)","v":{"$error":"#VALUE!"}},{"$f":"HLOOKUP(A239,'Courbe In'!$AA$2:$CD$7,5)","v":{"$error":"#VALUE!"}},{"$f":"HLOOKUP(A239,'Courbe In'!$AA$2:$CD$7,4)","v":{"$error":"#VALUE!"}},{"$f":"HLOOKUP(A239,'Courbe In'!$AA$2:$CD$7,6)","v":{"$error":"#VALUE!"}},{"$f":"HLOOKUP(A239,'Courbe In'!$AA$2:$CD$8,7)","v":{"$error":"#VALUE!"}},{"$f":"HLOOKUP(A239,'Courbe In'!$AA$2:$CD$9,8)","v":{"$error":"#VALUE!"}}]
["2021-09-12",null,{"$f":"HLOOKUP(A240,'Courbe In'!$AA$2:$CD$3,2)","v":{"$error":"#VALUE!"}},{"$f":"HLOOKUP(A240,'Courbe In'!$AA$2:$CD$7,5)","v":{"$error":"#VALUE!"}},{"$f":"HLOOKUP(A240,'Courbe In'!$AA$2:$CD$7,4)","v":{"$error":"#VALUE!"}},{"$f":"HLOOKUP(A240,'Courbe In'!$AA$2:$CD$7,6)","v":{"$error":"#VALUE!"}},{"$f":"HLOOKUP(A240,'Courbe In'!$AA$2:$CD$8,7)","v":{"$error":"#VALUE!"}},{"$f":"HLOOKUP(A240,'Courbe In'!$AA$2:$CD$9,8)","v":{"$error":"#VALUE!"}}]
["2021-09-13",null,{"$f":"HLOOKUP(A241,'Courbe In'!$AA$2:$CD$3,2)","v":{"$error":"#VALUE!"}},{"$f":"HLOOKUP(A241,'Courbe In'!$AA$2:$CD$7,5)","v":{"$error":"#VALUE!"}},{"$f":"HLOOKUP(A241,'Courbe In'!$AA$2:$CD$7,4)","v":{"$error":"#VALUE!"}},{"$f":"HLOOKUP(A241,'Courbe In'!$AA$2:$CD$7,6)","v":{"$error":"#VALUE!"}},{"$f":"HLOOKUP(A241,'Courbe In'!$AA$2:$CD$8,7)","v":{"$error":"#VALUE!"}},{"$f":"HLOOKUP(A241,'Courbe In'!$AA$2:$CD$9,8)","v":{"$error":"#VALUE!"}}]
["2021-09-14",null,{"$f":"HLOOKUP(A242,'Courbe In'!$AA$2:$CD$3,2)","v":{"$error":"#VALUE!"}},{"$f":"HLOOKUP(A242,'Courbe In'!$AA$2:$CD$7,5)","v":{"$error":"#VALUE!"}},{"$f":"HLOOKUP(A242,'Courbe In'!$AA$2:$CD$7,4)","v":{"$error":"#VALUE!"}},{"$f":"HLOOKUP(A242,'Courbe In'!$AA$2:$CD$7,6)","v":{"$error":"#VALUE!"}},{"$f":"HLOOKUP(A242,'Courbe In'!$AA$2:$CD$8,7)","v":{"$error":"#VALUE!"}},{"$f":"HLOOKUP(A242,'Courbe In'!$AA$2:$CD$9,8)","v":{"$error":"#VALUE!"}}]
["2021-09-15",null,{"$f":"HLOOKUP(A243,'Courbe In'!$AA$2:$CD$3,2)","v":{"$error":"#VALUE!"}},{"$f":"HLOOKUP(A243,'Courbe In'!$AA$2:$CD$7,5)","v":{"$error":"#VALUE!"}},{"$f":"HLOOKUP(A243,'Courbe In'!$AA$2:$CD$7,4)","v":{"$error":"#VALUE!"}},{"$f":"HLOOKUP(A243,'Courbe In'!$AA$2:$CD$7,6)","v":{"$error":"#VALUE!"}},{"$f":"HLOOKUP(A243,'Courbe In'!$AA$2:$CD$8,7)","v":{"$error":"#VALUE!"}},{"$f":"HLOOKUP(A243,'Courbe In'!$AA$2:$CD$9,8)","v":{"$error":"#VALUE!"}}]
["2021-09-16",null,{"$f":"HLOOKUP(A244,'Courbe In'!$AA$2:$CD$3,2)","v":{"$error":"#VALUE!"}},{"$f":"HLOOKUP(A244,'Courbe In'!$AA$2:$CD$7,5)","v":{"$error":"#VALUE!"}},{"$f":"HLOOKUP(A244,'Courbe In'!$AA$2:$CD$7,4)","v":{"$error":"#VALUE!"}},{"$f":"HLOOKUP(A244,'Courbe In'!$AA$2:$CD$7,6)","v":{"$error":"#VALUE!"}},{"$f":"HLOOKUP(A244,'Courbe In'!$AA$2:$CD$8,7)","v":{"$error":"#VALUE!"}},{"$f":"HLOOKUP(A244,'Courbe In'!$AA$2:$CD$9,8)","v":{"$error":"#VALUE!"}}]
["2021-09-17",null,{"$f":"HLOOKUP(A245,'Courbe In'!$AA$2:$CD$3,2)","v":{"$error":"#VALUE!"}},{"$f":"HLOOKUP(A245,'Courbe In'!$AA$2:$CD$7,5)","v":{"$error":"#VALUE!"}},{"$f":"HLOOKUP(A245,'Courbe In'!$AA$2:$CD$7,4)","v":{"$error":"#VALUE!"}},{"$f":"HLOOKUP(A245,'Courbe In'!$AA$2:$CD$7,6)","v":{"$error":"#VALUE!"}},{"$f":"HLOOKUP(A245,'Courbe In'!$AA$2:$CD$8,7)","v":{"$error":"#VALUE!"}},{"$f":"HLOOKUP(A245,'Courbe In'!$AA$2:$CD$9,8)","v":{"$error":"#VALUE!"}}]
["2021-09-18",null,{"$f":"HLOOKUP(A246,'Courbe In'!$AA$2:$CD$3,2)","v":{"$error":"#VALUE!"}},{"$f":"HLOOKUP(A246,'Courbe In'!$AA$2:$CD$7,5)","v":{"$error":"#VALUE!"}},{"$f":"HLOOKUP(A246,'Courbe In'!$AA$2:$CD$7,4)","v":{"$error":"#VALUE!"}},{"$f":"HLOOKUP(A246,'Courbe In'!$AA$2:$CD$7,6)","v":{"$error":"#VALUE!"}},{"$f":"HLOOKUP(A246,'Courbe In'!$AA$2:$CD$8,7)","v":{"$error":"#VALUE!"}},{"$f":"HLOOKUP(A246,'Courbe In'!$AA$2:$CD$9,8)","v":{"$error":"#VALUE!"}}]
["2021-09-19",null,{"$f":"HLOOKUP(A247,'Courbe In'!$AA$2:$CD$3,2)","v":{"$error":"#VALUE!"}},{"$f":"HLOOKUP(A247,'Courbe In'!$AA$2:$CD$7,5)","v":{"$error":"#VALUE!"}},{"$f":"HLOOKUP(A247,'Courbe In'!$AA$2:$CD$7,4)","v":{"$error":"#VALUE!"}},{"$f":"HLOOKUP(A247,'Courbe In'!$AA$2:$CD$7,6)","v":{"$error":"#VALUE!"}},{"$f":"HLOOKUP(A247,'Courbe In'!$AA$2:$CD$8,7)","v":{"$error":"#VALUE!"}},{"$f":"HLOOKUP(A247,'Courbe In'!$AA$2:$CD$9,8)","v":{"$error":"#VALUE!"}}]
["2021-09-20",null,{"$f":"HLOOKUP(A248,'Courbe In'!$AA$2:$CD$3,2)","v":{"$error":"#VALUE!"}},{"$f":"HLOOKUP(A248,'Courbe In'!$AA$2:$CD$7,5)","v":{"$error":"#VALUE!"}},{"$f":"HLOOKUP(A248,'Courbe In'!$AA$2:$CD$7,4)","v":{"$error":"#VALUE!"}},{"$f":"HLOOKUP(A248,'Courbe In'!$AA$2:$CD$7,6)","v":{"$error":"#VALUE!"}},{"$f":"HLOOKUP(A248,'Courbe In'!$AA$2:$CD$8,7)","v":{"$error":"#VALUE!"}},{"$f":"HLOOKUP(A248,'Courbe In'!$AA$2:$CD$9,8)","v":{"$error":"#VALUE!"}}]
["2021-09-21",null,{"$f":"HLOOKUP(A249,'Courbe In'!$AA$2:$CD$3,2)","v":{"$error":"#VALUE!"}},{"$f":"HLOOKUP(A249,'Courbe In'!$AA$2:$CD$7,5)","v":{"$error":"#VALUE!"}},{"$f":"HLOOKUP(A249,'Courbe In'!$AA$2:$CD$7,4)","v":{"$error":"#VALUE!"}},{"$f":"HLOOKUP(A249,'Courbe In'!$AA$2:$CD$7,6)","v":{"$error":"#VALUE!"}},{"$f":"HLOOKUP(A249,'Courbe In'!$AA$2:$CD$8,7)","v":{"$error":"#VALUE!"}},{"$f":"HLOOKUP(A249,'Courbe In'!$AA$2:$CD$9,8)","v":{"$error":"#VALUE!"}}]
["2021-09-22",null,{"$f":"HLOOKUP(A250,'Courbe In'!$AA$2:$CD$3,2)","v":{"$error":"#VALUE!"}},{"$f":"HLOOKUP(A250,'Courbe In'!$AA$2:$CD$7,5)","v":{"$error":"#VALUE!"}},{"$f":"HLOOKUP(A250,'Courbe In'!$AA$2:$CD$7,4)","v":{"$error":"#VALUE!"}},{"$f":"HLOOKUP(A250,'Courbe In'!$AA$2:$CD$7,6)","v":{"$error":"#VALUE!"}},{"$f":"HLOOKUP(A250,'Courbe In'!$AA$2:$CD$8,7)","v":{"$error":"#VALUE!"}},{"$f":"HLOOKUP(A250,'Courbe In'!$AA$2:$CD$9,8)","v":{"$error":"#VALUE!"}}]
["2021-09-23",null,{"$f":"HLOOKUP(A251,'Courbe In'!$AA$2:$CD$3,2)","v":{"$error":"#VALUE!"}},{"$f":"HLOOKUP(A251,'Courbe In'!$AA$2:$CD$7,5)","v":{"$error":"#VALUE!"}},{"$f":"HLOOKUP(A251,'Courbe In'!$AA$2:$CD$7,4)","v":{"$error":"#VALUE!"}},{"$f":"HLOOKUP(A251,'Courbe In'!$AA$2:$CD$7,6)","v":{"$error":"#VALUE!"}},{"$f":"HLOOKUP(A251,'Courbe In'!$AA$2:$CD$8,7)","v":{"$error":"#VALUE!"}},{"$f":"HLOOKUP(A251,'Courbe In'!$AA$2:$CD$9,8)","v":{"$error":"#VALUE!"}}]
["2021-09-24",null,{"$f":"HLOOKUP(A252,'Courbe In'!$AA$2:$CD$3,2)","v":{"$error":"#VALUE!"}},{"$f":"HLOOKUP(A252,'Courbe In'!$AA$2:$CD$7,5)","v":{"$error":"#VALUE!"}},{"$f":"HLOOKUP(A252,'Courbe In'!$AA$2:$CD$7,4)","v":{"$error":"#VALUE!"}},{"$f":"HLOOKUP(A252,'Courbe In'!$AA$2:$CD$7,6)","v":{"$error":"#VALUE!"}},{"$f":"HLOOKUP(A252,'Courbe In'!$AA$2:$CD$8,7)","v":{"$error":"#VALUE!"}},{"$f":"HLOOKUP(A252,'Courbe In'!$AA$2:$CD$9,8)","v":{"$error":"#VALUE!"}}]
["2021-09-25",null,{"$f":"HLOOKUP(A253,'Courbe In'!$AA$2:$CD$3,2)","v":{"$error":"#VALUE!"}},{"$f":"HLOOKUP(A253,'Courbe In'!$AA$2:$CD$7,5)","v":{"$error":"#VALUE!"}},{"$f":"HLOOKUP(A253,'Courbe In'!$AA$2:$CD$7,4)","v":{"$error":"#VALUE!"}},{"$f":"HLOOKUP(A253,'Courbe In'!$AA$2:$CD$7,6)","v":{"$error":"#VALUE!"}},{"$f":"HLOOKUP(A253,'Courbe In'!$AA$2:$CD$8,7)","v":{"$error":"#VALUE!"}},{"$f":"HLOOKUP(A253,'Courbe In'!$AA$2:$CD$9,8)","v":{"$error":"#VALUE!"}}]
["2021-09-26",null,{"$f":"HLOOKUP(A254,'Courbe In'!$AA$2:$CD$3,2)","v":{"$error":"#VALUE!"}},{"$f":"HLOOKUP(A254,'Courbe In'!$AA$2:$CD$7,5)","v":{"$error":"#VALUE!"}},{"$f":"HLOOKUP(A254,'Courbe In'!$AA$2:$CD$7,4)","v":{"$error":"#VALUE!"}},{"$f":"HLOOKUP(A254,'Courbe In'!$AA$2:$CD$7,6)","v":{"$error":"#VALUE!"}},{"$f":"HLOOKUP(A254,'Courbe In'!$AA$2:$CD$8,7)","v":{"$error":"#VALUE!"}},{"$f":"HLOOKUP(A254,'Courbe In'!$AA$2:$CD$9,8)","v":{"$error":"#VALUE!"}}]
["2021-09-27",null,{"$f":"HLOOKUP(A255,'Courbe In'!$AA$2:$CD$3,2)","v":{"$error":"#VALUE!"}},{"$f":"HLOOKUP(A255,'Courbe In'!$AA$2:$CD$7,5)","v":{"$error":"#VALUE!"}},{"$f":"HLOOKUP(A255,'Courbe In'!$AA$2:$CD$7,4)","v":{"$error":"#VALUE!"}},{"$f":"HLOOKUP(A255,'Courbe In'!$AA$2:$CD$7,6)","v":{"$error":"#VALUE!"}},{"$f":"HLOOKUP(A255,'Courbe In'!$AA$2:$CD$8,7)","v":{"$error":"#VALUE!"}},{"$f":"HLOOKUP(A255,'Courbe In'!$AA$2:$CD$9,8)","v":{"$error":"#VALUE!"}}]
["2021-09-28",null,{"$f":"HLOOKUP(A256,'Courbe In'!$AA$2:$CD$3,2)","v":{"$error":"#VALUE!"}},{"$f":"HLOOKUP(A256,'Courbe In'!$AA$2:$CD$7,5)","v":{"$error":"#VALUE!"}},{"$f":"HLOOKUP(A256,'Courbe In'!$AA$2:$CD$7,4)","v":{"$error":"#VALUE!"}},{"$f":"HLOOKUP(A256,'Courbe In'!$AA$2:$CD$7,6)","v":{"$error":"#VALUE!"}},{"$f":"HLOOKUP(A256,'Courbe In'!$AA$2:$CD$8,7)","v":{"$error":"#VALUE!"}},{"$f":"HLOOKUP(A256,'Courbe In'!$AA$2:$CD$9,8)","v":{"$error":"#VALUE!"}}]
["2021-09-29",null,{"$f":"HLOOKUP(A257,'Courbe In'!$AA$2:$CD$3,2)","v":{"$error":"#VALUE!"}},{"$f":"HLOOKUP(A257,'Courbe In'!$AA$2:$CD$7,5)","v":{"$error":"#VALUE!"}},{"$f":"HLOOKUP(A257,'Courbe In'!$AA$2:$CD$7,4)","v":{"$error":"#VALUE!"}},{"$f":"HLOOKUP(A257,'Courbe In'!$AA$2:$CD$7,6)","v":{"$error":"#VALUE!"}},{"$f":"HLOOKUP(A257,'Courbe In'!$AA$2:$CD$8,7)","v":{"$error":"#VALUE!"}},{"$f":"HLOOKUP(A257,'Courbe In'!$AA$2:$CD$9,8)","v":{"$error":"#VALUE!"}}]
["2021-09-30",null,{"$f":"HLOOKUP(A258,'Courbe In'!$AA$2:$CD$3,2)","v":{"$error":"#VALUE!"}},{"$f":"HLOOKUP(A258,'Courbe In'!$AA$2:$CD$7,5)","v":{"$error":"#VALUE!"}},{"$f":"HLOOKUP(A258,'Courbe In'!$AA$2:$CD$7,4)","v":{"$error":"#VALUE!"}},{"$f":"HLOOKUP(A258,'Courbe In'!$AA$2:$CD$7,6)","v":{"$error":"#VALUE!"}},{"$f":"HLOOKUP(A258,'Courbe In'!$AA$2:$CD$8,7)","v":{"$error":"#VALUE!"}},{"$f":"HLOOKUP(A258,'Courbe In'!$AA$2:$CD$9,8)","v":{"$error":"#VALUE!"}}]
["2021-10-01",null,{"$f":"HLOOKUP(A259,'Courbe In'!$AA$2:$CD$3,2)","v":{"$error":"#VALUE!"}},{"$f":"HLOOKUP(A259,'Courbe In'!$AA$2:$CD$7,5)","v":{"$error":"#VALUE!"}},{"$f":"HLOOKUP(A259,'Courbe In'!$AA$2:$CD$7,4)","v":{"$error":"#VALUE!"}},{"$f":"HLOOKUP(A259,'Courbe In'!$AA$2:$CD$7,6)","v":{"$error":"#VALUE!"}},{"$f":"HLOOKUP(A259,'Courbe In'!$AA$2:$CD$8,7)","v":{"$error":"#VALUE!"}},{"$f":"HLOOKUP(A259,'Courbe In'!$AA$2:$CD$9,8)","v":{"$error":"#VALUE!"}}]
[{"$f":"A259+1","v":"2021-10-02"},null,{"$f":"HLOOKUP(A260,'Courbe In'!$AA$2:$CD$3,2)","v":{"$error":"#VALUE!"}},{"$f":"HLOOKUP(A260,'Courbe In'!$AA$2:$CD$7,5)","v":{"$error":"#VALUE!"}},{"$f":"HLOOKUP(A260,'Courbe In'!$AA$2:$CD$7,4)","v":{"$error":"#VALUE!"}},{"$f":"HLOOKUP(A260,'Courbe In'!$AA$2:$CD$7,6)","v":{"$error":"#VALUE!"}},{"$f":"HLOOKUP(A260,'Courbe In'!$AA$2:$CD$8,7)","v":{"$error":"#VALUE!"}},{"$f":"HLOOKUP(A260,'Courbe In'!$AA$2:$CD$9,8)","v":{"$error":"#VALUE!"}}]
["2021-10-03",null,{"$f":"HLOOKUP(A261,'Courbe In'!$AA$2:$CD$3,2)","v":{"$error":"#VALUE!"}},{"$f":"HLOOKUP(A261,'Courbe In'!$AA$2:$CD$7,5)","v":{"$error":"#VALUE!"}},{"$f":"HLOOKUP(A261,'Courbe In'!$AA$2:$CD$7,4)","v":{"$error":"#VALUE!"}},{"$f":"HLOOKUP(A261,'Courbe In'!$AA$2:$CD$7,6)","v":{"$error":"#VALUE!"}},{"$f":"HLOOKUP(A261,'Courbe In'!$AA$2:$CD$8,7)","v":{"$error":"#VALUE!"}},{"$f":"HLOOKUP(A261,'Courbe In'!$AA$2:$CD$9,8)","v":{"$error":"#VALUE!"}}]
["2021-10-04",null,{"$f":"HLOOKUP(A262,'Courbe In'!$AA$2:$CD$3,2)","v":{"$error":"#VALUE!"}},{"$f":"HLOOKUP(A262,'Courbe In'!$AA$2:$CD$7,5)","v":{"$error":"#VALUE!"}},{"$f":"HLOOKUP(A262,'Courbe In'!$AA$2:$CD$7,4)","v":{"$error":"#VALUE!"}},{"$f":"HLOOKUP(A262,'Courbe In'!$AA$2:$CD$7,6)","v":{"$error":"#VALUE!"}},{"$f":"HLOOKUP(A262,'Courbe In'!$AA$2:$CD$8,7)","v":{"$error":"#VALUE!"}},{"$f":"HLOOKUP(A262,'Courbe In'!$AA$2:$CD$9,8)","v":{"$error":"#VALUE!"}}]
["2021-10-05",null,{"$f":"HLOOKUP(A263,'Courbe In'!$AA$2:$CD$3,2)","v":{"$error":"#VALUE!"}},{"$f":"HLOOKUP(A263,'Courbe In'!$AA$2:$CD$7,5)","v":{"$error":"#VALUE!"}},{"$f":"HLOOKUP(A263,'Courbe In'!$AA$2:$CD$7,4)","v":{"$error":"#VALUE!"}},{"$f":"HLOOKUP(A263,'Courbe In'!$AA$2:$CD$7,6)","v":{"$error":"#VALUE!"}},{"$f":"HLOOKUP(A263,'Courbe In'!$AA$2:$CD$8,7)","v":{"$error":"#VALUE!"}},{"$f":"HLOOKUP(A263,'Courbe In'!$AA$2:$CD$9,8)","v":{"$error":"#VALUE!"}}]
["2021-10-06",null,{"$f":"HLOOKUP(A264,'Courbe In'!$AA$2:$CD$3,2)","v":{"$error":"#VALUE!"}},{"$f":"HLOOKUP(A264,'Courbe In'!$AA$2:$CD$7,5)","v":{"$error":"#VALUE!"}},{"$f":"HLOOKUP(A264,'Courbe In'!$AA$2:$CD$7,4)","v":{"$error":"#VALUE!"}},{"$f":"HLOOKUP(A264,'Courbe In'!$AA$2:$CD$7,6)","v":{"$error":"#VALUE!"}},{"$f":"HLOOKUP(A264,'Courbe In'!$AA$2:$CD$8,7)","v":{"$error":"#VALUE!"}},{"$f":"HLOOKUP(A264,'Courbe In'!$AA$2:$CD$9,8)","v":{"$error":"#VALUE!"}}]
["2021-10-07",null,{"$f":"HLOOKUP(A265,'Courbe In'!$AA$2:$CD$3,2)","v":{"$error":"#VALUE!"}},{"$f":"HLOOKUP(A265,'Courbe In'!$AA$2:$CD$7,5)","v":{"$error":"#VALUE!"}},{"$f":"HLOOKUP(A265,'Courbe In'!$AA$2:$CD$7,4)","v":{"$error":"#VALUE!"}},{"$f":"HLOOKUP(A265,'Courbe In'!$AA$2:$CD$7,6)","v":{"$error":"#VALUE!"}},{"$f":"HLOOKUP(A265,'Courbe In'!$AA$2:$CD$8,7)","v":{"$error":"#VALUE!"}},{"$f":"HLOOKUP(A265,'Courbe In'!$AA$2:$CD$9,8)","v":{"$error":"#VALUE!"}}]
["2021-10-08",null,{"$f":"HLOOKUP(A266,'Courbe In'!$AA$2:$CD$3,2)","v":{"$error":"#VALUE!"}},{"$f":"HLOOKUP(A266,'Courbe In'!$AA$2:$CD$7,5)","v":{"$error":"#VALUE!"}},{"$f":"HLOOKUP(A266,'Courbe In'!$AA$2:$CD$7,4)","v":{"$error":"#VALUE!"}},{"$f":"HLOOKUP(A266,'Courbe In'!$AA$2:$CD$7,6)","v":{"$error":"#VALUE!"}},{"$f":"HLOOKUP(A266,'Courbe In'!$AA$2:$CD$8,7)","v":{"$error":"#VALUE!"}},{"$f":"HLOOKUP(A266,'Courbe In'!$AA$2:$CD$9,8)","v":{"$error":"#VALUE!"}}]
["2021-10-09",null,{"$f":"HLOOKUP(A267,'Courbe In'!$AA$2:$CD$3,2)","v":{"$error":"#VALUE!"}},{"$f":"HLOOKUP(A267,'Courbe In'!$AA$2:$CD$7,5)","v":{"$error":"#VALUE!"}},{"$f":"HLOOKUP(A267,'Courbe In'!$AA$2:$CD$7,4)","v":{"$error":"#VALUE!"}},{"$f":"HLOOKUP(A267,'Courbe In'!$AA$2:$CD$7,6)","v":{"$error":"#VALUE!"}},{"$f":"HLOOKUP(A267,'Courbe In'!$AA$2:$CD$8,7)","v":{"$error":"#VALUE!"}},{"$f":"HLOOKUP(A267,'Courbe In'!$AA$2:$CD$9,8)","v":{"$error":"#VALUE!"}}]
["2021-10-10",null,{"$f":"HLOOKUP(A268,'Courbe In'!$AA$2:$CD$3,2)","v":{"$error":"#VALUE!"}},{"$f":"HLOOKUP(A268,'Courbe In'!$AA$2:$CD$7,5)","v":{"$error":"#VALUE!"}},{"$f":"HLOOKUP(A268,'Courbe In'!$AA$2:$CD$7,4)","v":{"$error":"#VALUE!"}},{"$f":"HLOOKUP(A268,'Courbe In'!$AA$2:$CD$7,6)","v":{"$error":"#VALUE!"}},{"$f":"HLOOKUP(A268,'Courbe In'!$AA$2:$CD$8,7)","v":{"$error":"#VALUE!"}},{"$f":"HLOOKUP(A268,'Courbe In'!$AA$2:$CD$9,8)","v":{"$error":"#VALUE!"}}]
["2021-10-11",null,{"$f":"HLOOKUP(A269,'Courbe In'!$AA$2:$CD$3,2)","v":{"$error":"#VALUE!"}},{"$f":"HLOOKUP(A269,'Courbe In'!$AA$2:$CD$7,5)","v":{"$error":"#VALUE!"}},{"$f":"HLOOKUP(A269,'Courbe In'!$AA$2:$CD$7,4)","v":{"$error":"#VALUE!"}},{"$f":"HLOOKUP(A269,'Courbe In'!$AA$2:$CD$7,6)","v":{"$error":"#VALUE!"}},{"$f":"HLOOKUP(A269,'Courbe In'!$AA$2:$CD$8,7)","v":{"$error":"#VALUE!"}},{"$f":"HLOOKUP(A269,'Courbe In'!$AA$2:$CD$9,8)","v":{"$error":"#VALUE!"}}]
["2021-10-12",null,{"$f":"HLOOKUP(A270,'Courbe In'!$AA$2:$CD$3,2)","v":{"$error":"#VALUE!"}},{"$f":"HLOOKUP(A270,'Courbe In'!$AA$2:$CD$7,5)","v":{"$error":"#VALUE!"}},{"$f":"HLOOKUP(A270,'Courbe In'!$AA$2:$CD$7,4)","v":{"$error":"#VALUE!"}},{"$f":"HLOOKUP(A270,'Courbe In'!$AA$2:$CD$7,6)","v":{"$error":"#VALUE!"}},{"$f":"HLOOKUP(A270,'Courbe In'!$AA$2:$CD$8,7)","v":{"$error":"#VALUE!"}},{"$f":"HLOOKUP(A270,'Courbe In'!$AA$2:$CD$9,8)","v":{"$error":"#VALUE!"}}]
["2021-10-13",null,{"$f":"HLOOKUP(A271,'Courbe In'!$AA$2:$CD$3,2)","v":{"$error":"#VALUE!"}},{"$f":"HLOOKUP(A271,'Courbe In'!$AA$2:$CD$7,5)","v":{"$error":"#VALUE!"}},{"$f":"HLOOKUP(A271,'Courbe In'!$AA$2:$CD$7,4)","v":{"$error":"#VALUE!"}},{"$f":"HLOOKUP(A271,'Courbe In'!$AA$2:$CD$7,6)","v":{"$error":"#VALUE!"}},{"$f":"HLOOKUP(A271,'Courbe In'!$AA$2:$CD$8,7)","v":{"$error":"#VALUE!"}},{"$f":"HLOOKUP(A271,'Courbe In'!$AA$2:$CD$9,8)","v":{"$error":"#VALUE!"}}]
["2021-10-14",null,{"$f":"HLOOKUP(A272,'Courbe In'!$AA$2:$CD$3,2)","v":{"$error":"#VALUE!"}},{"$f":"HLOOKUP(A272,'Courbe In'!$AA$2:$CD$7,5)","v":{"$error":"#VALUE!"}},{"$f":"HLOOKUP(A272,'Courbe In'!$AA$2:$CD$7,4)","v":{"$error":"#VALUE!"}},{"$f":"HLOOKUP(A272,'Courbe In'!$AA$2:$CD$7,6)","v":{"$error":"#VALUE!"}},{"$f":"HLOOKUP(A272,'Courbe In'!$AA$2:$CD$8,7)","v":{"$error":"#VALUE!"}},{"$f":"HLOOKUP(A272,'Courbe In'!$AA$2:$CD$9,8)","v":{"$error":"#VALUE!"}}]
["2021-10-15",null,{"$f":"HLOOKUP(A273,'Courbe In'!$AA$2:$CD$3,2)","v":{"$error":"#VALUE!"}},{"$f":"HLOOKUP(A273,'Courbe In'!$AA$2:$CD$7,5)","v":{"$error":"#VALUE!"}},{"$f":"HLOOKUP(A273,'Courbe In'!$AA$2:$CD$7,4)","v":{"$error":"#VALUE!"}},{"$f":"HLOOKUP(A273,'Courbe In'!$AA$2:$CD$7,6)","v":{"$error":"#VALUE!"}},{"$f":"HLOOKUP(A273,'Courbe In'!$AA$2:$CD$8,7)","v":{"$error":"#VALUE!"}},{"$f":"HLOOKUP(A273,'Courbe In'!$AA$2:$CD$9,8)","v":{"$error":"#VALUE!"}}]
["2021-10-16",null,{"$f":"HLOOKUP(A274,'Courbe In'!$AA$2:$CD$3,2)","v":{"$error":"#VALUE!"}},{"$f":"HLOOKUP(A274,'Courbe In'!$AA$2:$CD$7,5)","v":{"$error":"#VALUE!"}},{"$f":"HLOOKUP(A274,'Courbe In'!$AA$2:$CD$7,4)","v":{"$error":"#VALUE!"}},{"$f":"HLOOKUP(A274,'Courbe In'!$AA$2:$CD$7,6)","v":{"$error":"#VALUE!"}},{"$f":"HLOOKUP(A274,'Courbe In'!$AA$2:$CD$8,7)","v":{"$error":"#VALUE!"}},{"$f":"HLOOKUP(A274,'Courbe In'!$AA$2:$CD$9,8)","v":{"$error":"#VALUE!"}}]
["2021-10-17",null,{"$f":"HLOOKUP(A275,'Courbe In'!$AA$2:$CD$3,2)","v":{"$error":"#VALUE!"}},{"$f":"HLOOKUP(A275,'Courbe In'!$AA$2:$CD$7,5)","v":{"$error":"#VALUE!"}},{"$f":"HLOOKUP(A275,'Courbe In'!$AA$2:$CD$7,4)","v":{"$error":"#VALUE!"}},{"$f":"HLOOKUP(A275,'Courbe In'!$AA$2:$CD$7,6)","v":{"$error":"#VALUE!"}},{"$f":"HLOOKUP(A275,'Courbe In'!$AA$2:$CD$8,7)","v":{"$error":"#VALUE!"}},{"$f":"HLOOKUP(A275,'Courbe In'!$AA$2:$CD$9,8)","v":{"$error":"#VALUE!"}}]
["2021-10-18",null,{"$f":"HLOOKUP(A276,'Courbe In'!$AA$2:$CD$3,2)","v":{"$error":"#VALUE!"}},{"$f":"HLOOKUP(A276,'Courbe In'!$AA$2:$CD$7,5)","v":{"$error":"#VALUE!"}},{"$f":"HLOOKUP(A276,'Courbe In'!$AA$2:$CD$7,4)","v":{"$error":"#VALUE!"}},{"$f":"HLOOKUP(A276,'Courbe In'!$AA$2:$CD$7,6)","v":{"$error":"#VALUE!"}},{"$f":"HLOOKUP(A276,'Courbe In'!$AA$2:$CD$8,7)","v":{"$error":"#VALUE!"}},{"$f":"HLOOKUP(A276,'Courbe In'!$AA$2:$CD$9,8)","v":{"$error":"#VALUE!"}}]
["2021-10-19",null,{"$f":"HLOOKUP(A277,'Courbe In'!$AA$2:$CD$3,2)","v":{"$error":"#VALUE!"}},{"$f":"HLOOKUP(A277,'Courbe In'!$AA$2:$CD$7,5)","v":{"$error":"#VALUE!"}},{"$f":"HLOOKUP(A277,'Courbe In'!$AA$2:$CD$7,4)","v":{"$error":"#VALUE!"}},{"$f":"HLOOKUP(A277,'Courbe In'!$AA$2:$CD$7,6)","v":{"$error":"#VALUE!"}},{"$f":"HLOOKUP(A277,'Courbe In'!$AA$2:$CD$8,7)","v":{"$error":"#VALUE!"}},{"$f":"HLOOKUP(A277,'Courbe In'!$AA$2:$CD$9,8)","v":{"$error":"#VALUE!"}}]
["2021-10-20",null,{"$f":"HLOOKUP(A278,'Courbe In'!$AA$2:$CD$3,2)","v":{"$error":"#VALUE!"}},{"$f":"HLOOKUP(A278,'Courbe In'!$AA$2:$CD$7,5)","v":{"$error":"#VALUE!"}},{"$f":"HLOOKUP(A278,'Courbe In'!$AA$2:$CD$7,4)","v":{"$error":"#VALUE!"}},{"$f":"HLOOKUP(A278,'Courbe In'!$AA$2:$CD$7,6)","v":{"$error":"#VALUE!"}},{"$f":"HLOOKUP(A278,'Courbe In'!$AA$2:$CD$8,7)","v":{"$error":"#VALUE!"}},{"$f":"HLOOKUP(A278,'Courbe In'!$AA$2:$CD$9,8)","v":{"$error":"#VALUE!"}}]
["2021-10-21",null,{"$f":"HLOOKUP(A279,'Courbe In'!$AA$2:$CD$3,2)","v":{"$error":"#VALUE!"}},{"$f":"HLOOKUP(A279,'Courbe In'!$AA$2:$CD$7,5)","v":{"$error":"#VALUE!"}},{"$f":"HLOOKUP(A279,'Courbe In'!$AA$2:$CD$7,4)","v":{"$error":"#VALUE!"}},{"$f":"HLOOKUP(A279,'Courbe In'!$AA$2:$CD$7,6)","v":{"$error":"#VALUE!"}},{"$f":"HLOOKUP(A279,'Courbe In'!$AA$2:$CD$8,7)","v":{"$error":"#VALUE!"}},{"$f":"HLOOKUP(A279,'Courbe In'!$AA$2:$CD$9,8)","v":{"$error":"#VALUE!"}}]
["2021-10-22",null,{"$f":"HLOOKUP(A280,'Courbe In'!$AA$2:$CD$3,2)","v":{"$error":"#VALUE!"}},{"$f":"HLOOKUP(A280,'Courbe In'!$AA$2:$CD$7,5)","v":{"$error":"#VALUE!"}},{"$f":"HLOOKUP(A280,'Courbe In'!$AA$2:$CD$7,4)","v":{"$error":"#VALUE!"}},{"$f":"HLOOKUP(A280,'Courbe In'!$AA$2:$CD$7,6)","v":{"$error":"#VALUE!"}},{"$f":"HLOOKUP(A280,'Courbe In'!$AA$2:$CD$8,7)","v":{"$error":"#VALUE!"}},{"$f":"HLOOKUP(A280,'Courbe In'!$AA$2:$CD$9,8)","v":{"$error":"#VALUE!"}}]
["2021-10-23",null,{"$f":"HLOOKUP(A281,'Courbe In'!$AA$2:$CD$3,2)","v":{"$error":"#VALUE!"}},{"$f":"HLOOKUP(A281,'Courbe In'!$AA$2:$CD$7,5)","v":{"$error":"#VALUE!"}},{"$f":"HLOOKUP(A281,'Courbe In'!$AA$2:$CD$7,4)","v":{"$error":"#VALUE!"}},{"$f":"HLOOKUP(A281,'Courbe In'!$AA$2:$CD$7,6)","v":{"$error":"#VALUE!"}},{"$f":"HLOOKUP(A281,'Courbe In'!$AA$2:$CD$8,7)","v":{"$error":"#VALUE!"}},{"$f":"HLOOKUP(A281,'Courbe In'!$AA$2:$CD$9,8)","v":{"$error":"#VALUE!"}}]
["2021-10-24",null,{"$f":"HLOOKUP(A282,'Courbe In'!$AA$2:$CD$3,2)","v":{"$error":"#VALUE!"}},{"$f":"HLOOKUP(A282,'Courbe In'!$AA$2:$CD$7,5)","v":{"$error":"#VALUE!"}},{"$f":"HLOOKUP(A282,'Courbe In'!$AA$2:$CD$7,4)","v":{"$error":"#VALUE!"}},{"$f":"HLOOKUP(A282,'Courbe In'!$AA$2:$CD$7,6)","v":{"$error":"#VALUE!"}},{"$f":"HLOOKUP(A282,'Courbe In'!$AA$2:$CD$8,7)","v":{"$error":"#VALUE!"}},{"$f":"HLOOKUP(A282,'Courbe In'!$AA$2:$CD$9,8)","v":{"$error":"#VALUE!"}}]
["2021-10-25",null,{"$f":"HLOOKUP(A283,'Courbe In'!$AA$2:$CD$3,2)","v":{"$error":"#VALUE!"}},{"$f":"HLOOKUP(A283,'Courbe In'!$AA$2:$CD$7,5)","v":{"$error":"#VALUE!"}},{"$f":"HLOOKUP(A283,'Courbe In'!$AA$2:$CD$7,4)","v":{"$error":"#VALUE!"}},{"$f":"HLOOKUP(A283,'Courbe In'!$AA$2:$CD$7,6)","v":{"$error":"#VALUE!"}},{"$f":"HLOOKUP(A283,'Courbe In'!$AA$2:$CD$8,7)","v":{"$error":"#VALUE!"}},{"$f":"HLOOKUP(A283,'Courbe In'!$AA$2:$CD$9,8)","v":{"$error":"#VALUE!"}}]
["2021-10-26",null,{"$f":"HLOOKUP(A284,'Courbe In'!$AA$2:$CD$3,2)","v":{"$error":"#VALUE!"}},{"$f":"HLOOKUP(A284,'Courbe In'!$AA$2:$CD$7,5)","v":{"$error":"#VALUE!"}},{"$f":"HLOOKUP(A284,'Courbe In'!$AA$2:$CD$7,4)","v":{"$error":"#VALUE!"}},{"$f":"HLOOKUP(A284,'Courbe In'!$AA$2:$CD$7,6)","v":{"$error":"#VALUE!"}},{"$f":"HLOOKUP(A284,'Courbe In'!$AA$2:$CD$8,7)","v":{"$error":"#VALUE!"}},{"$f":"HLOOKUP(A284,'Courbe In'!$AA$2:$CD$9,8)","v":{"$error":"#VALUE!"}}]
["2021-10-27",null,{"$f":"HLOOKUP(A285,'Courbe In'!$AA$2:$CD$3,2)","v":{"$error":"#VALUE!"}},{"$f":"HLOOKUP(A285,'Courbe In'!$AA$2:$CD$7,5)","v":{"$error":"#VALUE!"}},{"$f":"HLOOKUP(A285,'Courbe In'!$AA$2:$CD$7,4)","v":{"$error":"#VALUE!"}},{"$f":"HLOOKUP(A285,'Courbe In'!$AA$2:$CD$7,6)","v":{"$error":"#VALUE!"}},{"$f":"HLOOKUP(A285,'Courbe In'!$AA$2:$CD$8,7)","v":{"$error":"#VALUE!"}},{"$f":"HLOOKUP(A285,'Courbe In'!$AA$2:$CD$9,8)","v":{"$error":"#VALUE!"}}]
["2021-10-28",null,{"$f":"HLOOKUP(A286,'Courbe In'!$AA$2:$CD$3,2)","v":{"$error":"#VALUE!"}},{"$f":"HLOOKUP(A286,'Courbe In'!$AA$2:$CD$7,5)","v":{"$error":"#VALUE!"}},{"$f":"HLOOKUP(A286,'Courbe In'!$AA$2:$CD$7,4)","v":{"$error":"#VALUE!"}},{"$f":"HLOOKUP(A286,'Courbe In'!$AA$2:$CD$7,6)","v":{"$error":"#VALUE!"}},{"$f":"HLOOKUP(A286,'Courbe In'!$AA$2:$CD$8,7)","v":{"$error":"#VALUE!"}},{"$f":"HLOOKUP(A286,'Courbe In'!$AA$2:$CD$9,8)","v":{"$error":"#VALUE!"}}]
["2021-10-29",null,{"$f":"HLOOKUP(A287,'Courbe In'!$AA$2:$CD$3,2)","v":{"$error":"#VALUE!"}},{"$f":"HLOOKUP(A287,'Courbe In'!$AA$2:$CD$7,5)","v":{"$error":"#VALUE!"}},{"$f":"HLOOKUP(A287,'Courbe In'!$AA$2:$CD$7,4)","v":{"$error":"#VALUE!"}},{"$f":"HLOOKUP(A287,'Courbe In'!$AA$2:$CD$7,6)","v":{"$error":"#VALUE!"}},{"$f":"HLOOKUP(A287,'Courbe In'!$AA$2:$CD$8,7)","v":{"$error":"#VALUE!"}},{"$f":"HLOOKUP(A287,'Courbe In'!$AA$2:$CD$9,8)","v":{"$error":"#VALUE!"}}]
["2021-10-30",null,{"$f":"HLOOKUP(A288,'Courbe In'!$AA$2:$CD$3,2)","v":{"$error":"#VALUE!"}},{"$f":"HLOOKUP(A288,'Courbe In'!$AA$2:$CD$7,5)","v":{"$error":"#VALUE!"}},{"$f":"HLOOKUP(A288,'Courbe In'!$AA$2:$CD$7,4)","v":{"$error":"#VALUE!"}},{"$f":"HLOOKUP(A288,'Courbe In'!$AA$2:$CD$7,6)","v":{"$error":"#VALUE!"}},{"$f":"HLOOKUP(A288,'Courbe In'!$AA$2:$CD$8,7)","v":{"$error":"#VALUE!"}},{"$f":"HLOOKUP(A288,'Courbe In'!$AA$2:$CD$9,8)","v":{"$error":"#VALUE!"}}]
["2021-10-31",null,{"$f":"HLOOKUP(A289,'Courbe In'!$AA$2:$CD$3,2)","v":{"$error":"#VALUE!"}},{"$f":"HLOOKUP(A289,'Courbe In'!$AA$2:$CD$7,5)","v":{"$error":"#VALUE!"}},{"$f":"HLOOKUP(A289,'Courbe In'!$AA$2:$CD$7,4)","v":{"$error":"#VALUE!"}},{"$f":"HLOOKUP(A289,'Courbe In'!$AA$2:$CD$7,6)","v":{"$error":"#VALUE!"}},{"$f":"HLOOKUP(A289,'Courbe In'!$AA$2:$CD$8,7)","v":{"$error":"#VALUE!"}},{"$f":"HLOOKUP(A289,'Courbe In'!$AA$2:$CD$9,8)","v":{"$error":"#VALUE!"}}]
["2021-11-01",null,{"$f":"HLOOKUP(A290,'Courbe In'!$AA$2:$CD$3,2)","v":{"$error":"#VALUE!"}},{"$f":"HLOOKUP(A290,'Courbe In'!$AA$2:$CD$7,5)","v":{"$error":"#VALUE!"}},{"$f":"HLOOKUP(A290,'Courbe In'!$AA$2:$CD$7,4)","v":{"$error":"#VALUE!"}},{"$f":"HLOOKUP(A290,'Courbe In'!$AA$2:$CD$7,6)","v":{"$error":"#VALUE!"}},{"$f":"HLOOKUP(A290,'Courbe In'!$AA$2:$CD$8,7)","v":{"$error":"#VALUE!"}},{"$f":"HLOOKUP(A290,'Courbe In'!$AA$2:$CD$9,8)","v":{"$error":"#VALUE!"}}]
["2021-11-02",null,{"$f":"HLOOKUP(A291,'Courbe In'!$AA$2:$CD$3,2)","v":{"$error":"#VALUE!"}},{"$f":"HLOOKUP(A291,'Courbe In'!$AA$2:$CD$7,5)","v":{"$error":"#VALUE!"}},{"$f":"HLOOKUP(A291,'Courbe In'!$AA$2:$CD$7,4)","v":{"$error":"#VALUE!"}},{"$f":"HLOOKUP(A291,'Courbe In'!$AA$2:$CD$7,6)","v":{"$error":"#VALUE!"}},{"$f":"HLOOKUP(A291,'Courbe In'!$AA$2:$CD$8,7)","v":{"$error":"#VALUE!"}},{"$f":"HLOOKUP(A291,'Courbe In'!$AA$2:$CD$9,8)","v":{"$error":"#VALUE!"}}]
["2021-11-03",null,{"$f":"HLOOKUP(A292,'Courbe In'!$AA$2:$CD$3,2)","v":{"$error":"#VALUE!"}},{"$f":"HLOOKUP(A292,'Courbe In'!$AA$2:$CD$7,5)","v":{"$error":"#VALUE!"}},{"$f":"HLOOKUP(A292,'Courbe In'!$AA$2:$CD$7,4)","v":{"$error":"#VALUE!"}},{"$f":"HLOOKUP(A292,'Courbe In'!$AA$2:$CD$7,6)","v":{"$error":"#VALUE!"}},{"$f":"HLOOKUP(A292,'Courbe In'!$AA$2:$CD$8,7)","v":{"$error":"#VALUE!"}},{"$f":"HLOOKUP(A292,'Courbe In'!$AA$2:$CD$9,8)","v":{"$error":"#VALUE!"}}]
["2021-11-04",null,{"$f":"HLOOKUP(A293,'Courbe In'!$AA$2:$CD$3,2)","v":{"$error":"#VALUE!"}},{"$f":"HLOOKUP(A293,'Courbe In'!$AA$2:$CD$7,5)","v":{"$error":"#VALUE!"}},{"$f":"HLOOKUP(A293,'Courbe In'!$AA$2:$CD$7,4)","v":{"$error":"#VALUE!"}},{"$f":"HLOOKUP(A293,'Courbe In'!$AA$2:$CD$7,6)","v":{"$error":"#VALUE!"}},{"$f":"HLOOKUP(A293,'Courbe In'!$AA$2:$CD$8,7)","v":{"$error":"#VALUE!"}},{"$f":"HLOOKUP(A293,'Courbe In'!$AA$2:$CD$9,8)","v":{"$error":"#VALUE!"}}]
["2021-11-05",null,{"$f":"HLOOKUP(A294,'Courbe In'!$AA$2:$CD$3,2)","v":{"$error":"#VALUE!"}},{"$f":"HLOOKUP(A294,'Courbe In'!$AA$2:$CD$7,5)","v":{"$error":"#VALUE!"}},{"$f":"HLOOKUP(A294,'Courbe In'!$AA$2:$CD$7,4)","v":{"$error":"#VALUE!"}},{"$f":"HLOOKUP(A294,'Courbe In'!$AA$2:$CD$7,6)","v":{"$error":"#VALUE!"}},{"$f":"HLOOKUP(A294,'Courbe In'!$AA$2:$CD$8,7)","v":{"$error":"#VALUE!"}},{"$f":"HLOOKUP(A294,'Courbe In'!$AA$2:$CD$9,8)","v":{"$error":"#VALUE!"}}]
["2021-11-06",null,{"$f":"HLOOKUP(A295,'Courbe In'!$AA$2:$CD$3,2)","v":{"$error":"#VALUE!"}},{"$f":"HLOOKUP(A295,'Courbe In'!$AA$2:$CD$7,5)","v":{"$error":"#VALUE!"}},{"$f":"HLOOKUP(A295,'Courbe In'!$AA$2:$CD$7,4)","v":{"$error":"#VALUE!"}},{"$f":"HLOOKUP(A295,'Courbe In'!$AA$2:$CD$7,6)","v":{"$error":"#VALUE!"}},{"$f":"HLOOKUP(A295,'Courbe In'!$AA$2:$CD$8,7)","v":{"$error":"#VALUE!"}},{"$f":"HLOOKUP(A295,'Courbe In'!$AA$2:$CD$9,8)","v":{"$error":"#VALUE!"}}]
["2021-11-07",null,{"$f":"HLOOKUP(A296,'Courbe In'!$AA$2:$CD$3,2)","v":{"$error":"#VALUE!"}},{"$f":"HLOOKUP(A296,'Courbe In'!$AA$2:$CD$7,5)","v":{"$error":"#VALUE!"}},{"$f":"HLOOKUP(A296,'Courbe In'!$AA$2:$CD$7,4)","v":{"$error":"#VALUE!"}},{"$f":"HLOOKUP(A296,'Courbe In'!$AA$2:$CD$7,6)","v":{"$error":"#VALUE!"}},{"$f":"HLOOKUP(A296,'Courbe In'!$AA$2:$CD$8,7)","v":{"$error":"#VALUE!"}},{"$f":"HLOOKUP(A296,'Courbe In'!$AA$2:$CD$9,8)","v":{"$error":"#VALUE!"}}]
["2021-11-08",null,{"$f":"HLOOKUP(A297,'Courbe In'!$AA$2:$CD$3,2)","v":{"$error":"#VALUE!"}},{"$f":"HLOOKUP(A297,'Courbe In'!$AA$2:$CD$7,5)","v":{"$error":"#VALUE!"}},{"$f":"HLOOKUP(A297,'Courbe In'!$AA$2:$CD$7,4)","v":{"$error":"#VALUE!"}},{"$f":"HLOOKUP(A297,'Courbe In'!$AA$2:$CD$7,6)","v":{"$error":"#VALUE!"}},{"$f":"HLOOKUP(A297,'Courbe In'!$AA$2:$CD$8,7)","v":{"$error":"#VALUE!"}},{"$f":"HLOOKUP(A297,'Courbe In'!$AA$2:$CD$9,8)","v":{"$error":"#VALUE!"}}]
["2021-11-09",null,{"$f":"HLOOKUP(A298,'Courbe In'!$AA$2:$CD$3,2)","v":{"$error":"#VALUE!"}},{"$f":"HLOOKUP(A298,'Courbe In'!$AA$2:$CD$7,5)","v":{"$error":"#VALUE!"}},{"$f":"HLOOKUP(A298,'Courbe In'!$AA$2:$CD$7,4)","v":{"$error":"#VALUE!"}},{"$f":"HLOOKUP(A298,'Courbe In'!$AA$2:$CD$7,6)","v":{"$error":"#VALUE!"}},{"$f":"HLOOKUP(A298,'Courbe In'!$AA$2:$CD$8,7)","v":{"$error":"#VALUE!"}},{"$f":"HLOOKUP(A298,'Courbe In'!$AA$2:$CD$9,8)","v":{"$error":"#VALUE!"}}]
["2021-11-10",null,{"$f":"HLOOKUP(A299,'Courbe In'!$AA$2:$CD$3,2)","v":{"$error":"#VALUE!"}},{"$f":"HLOOKUP(A299,'Courbe In'!$AA$2:$CD$7,5)","v":{"$error":"#VALUE!"}},{"$f":"HLOOKUP(A299,'Courbe In'!$AA$2:$CD$7,4)","v":{"$error":"#VALUE!"}},{"$f":"HLOOKUP(A299,'Courbe In'!$AA$2:$CD$7,6)","v":{"$error":"#VALUE!"}},{"$f":"HLOOKUP(A299,'Courbe In'!$AA$2:$CD$8,7)","v":{"$error":"#VALUE!"}},{"$f":"HLOOKUP(A299,'Courbe In'!$AA$2:$CD$9,8)","v":{"$error":"#VALUE!"}}]
["2021-11-11",null,{"$f":"HLOOKUP(A300,'Courbe In'!$AA$2:$CD$3,2)","v":{"$error":"#VALUE!"}},{"$f":"HLOOKUP(A300,'Courbe In'!$AA$2:$CD$7,5)","v":{"$error":"#VALUE!"}},{"$f":"HLOOKUP(A300,'Courbe In'!$AA$2:$CD$7,4)","v":{"$error":"#VALUE!"}},{"$f":"HLOOKUP(A300,'Courbe In'!$AA$2:$CD$7,6)","v":{"$error":"#VALUE!"}},{"$f":"HLOOKUP(A300,'Courbe In'!$AA$2:$CD$8,7)","v":{"$error":"#VALUE!"}},{"$f":"HLOOKUP(A300,'Courbe In'!$AA$2:$CD$9,8)","v":{"$error":"#VALUE!"}}]
["2021-11-12",null,{"$f":"HLOOKUP(A301,'Courbe In'!$AA$2:$CD$3,2)","v":{"$error":"#VALUE!"}},{"$f":"HLOOKUP(A301,'Courbe In'!$AA$2:$CD$7,5)","v":{"$error":"#VALUE!"}},{"$f":"HLOOKUP(A301,'Courbe In'!$AA$2:$CD$7,4)","v":{"$error":"#VALUE!"}},{"$f":"HLOOKUP(A301,'Courbe In'!$AA$2:$CD$7,6)","v":{"$error":"#VALUE!"}},{"$f":"HLOOKUP(A301,'Courbe In'!$AA$2:$CD$8,7)","v":{"$error":"#VALUE!"}},{"$f":"HLOOKUP(A301,'Courbe In'!$AA$2:$CD$9,8)","v":{"$error":"#VALUE!"}}]
["2021-11-13",null,{"$f":"HLOOKUP(A302,'Courbe In'!$AA$2:$CD$3,2)","v":{"$error":"#VALUE!"}},{"$f":"HLOOKUP(A302,'Courbe In'!$AA$2:$CD$7,5)","v":{"$error":"#VALUE!"}},{"$f":"HLOOKUP(A302,'Courbe In'!$AA$2:$CD$7,4)","v":{"$error":"#VALUE!"}},{"$f":"HLOOKUP(A302,'Courbe In'!$AA$2:$CD$7,6)","v":{"$error":"#VALUE!"}},{"$f":"HLOOKUP(A302,'Courbe In'!$AA$2:$CD$8,7)","v":{"$error":"#VALUE!"}},{"$f":"HLOOKUP(A302,'Courbe In'!$AA$2:$CD$9,8)","v":{"$error":"#VALUE!"}}]
["2021-11-14",null,{"$f":"HLOOKUP(A303,'Courbe In'!$AA$2:$CD$3,2)","v":{"$error":"#VALUE!"}},{"$f":"HLOOKUP(A303,'Courbe In'!$AA$2:$CD$7,5)","v":{"$error":"#VALUE!"}},{"$f":"HLOOKUP(A303,'Courbe In'!$AA$2:$CD$7,4)","v":{"$error":"#VALUE!"}},{"$f":"HLOOKUP(A303,'Courbe In'!$AA$2:$CD$7,6)","v":{"$error":"#VALUE!"}},{"$f":"HLOOKUP(A303,'Courbe In'!$AA$2:$CD$8,7)","v":{"$error":"#VALUE!"}},{"$f":"HLOOKUP(A303,'Courbe In'!$AA$2:$CD$9,8)","v":{"$error":"#VALUE!"}}]
["2021-11-15",null,{"$f":"HLOOKUP(A304,'Courbe In'!$AA$2:$CD$3,2)","v":{"$error":"#VALUE!"}},{"$f":"HLOOKUP(A304,'Courbe In'!$AA$2:$CD$7,5)","v":{"$error":"#VALUE!"}},{"$f":"HLOOKUP(A304,'Courbe In'!$AA$2:$CD$7,4)","v":{"$error":"#VALUE!"}},{"$f":"HLOOKUP(A304,'Courbe In'!$AA$2:$CD$7,6)","v":{"$error":"#VALUE!"}},{"$f":"HLOOKUP(A304,'Courbe In'!$AA$2:$CD$8,7)","v":{"$error":"#VALUE!"}},{"$f":"HLOOKUP(A304,'Courbe In'!$AA$2:$CD$9,8)","v":{"$error":"#VALUE!"}}]
["2021-11-16",null,{"$f":"HLOOKUP(A305,'Courbe In'!$AA$2:$CD$3,2)","v":{"$error":"#VALUE!"}},{"$f":"HLOOKUP(A305,'Courbe In'!$AA$2:$CD$7,5)","v":{"$error":"#VALUE!"}},{"$f":"HLOOKUP(A305,'Courbe In'!$AA$2:$CD$7,4)","v":{"$error":"#VALUE!"}},{"$f":"HLOOKUP(A305,'Courbe In'!$AA$2:$CD$7,6)","v":{"$error":"#VALUE!"}},{"$f":"HLOOKUP(A305,'Courbe In'!$AA$2:$CD$8,7)","v":{"$error":"#VALUE!"}},{"$f":"HLOOKUP(A305,'Courbe In'!$AA$2:$CD$9,8)","v":{"$error":"#VALUE!"}}]
["2021-11-17",null,{"$f":"HLOOKUP(A306,'Courbe In'!$AA$2:$CD$3,2)","v":{"$error":"#VALUE!"}},{"$f":"HLOOKUP(A306,'Courbe In'!$AA$2:$CD$7,5)","v":{"$error":"#VALUE!"}},{"$f":"HLOOKUP(A306,'Courbe In'!$AA$2:$CD$7,4)","v":{"$error":"#VALUE!"}},{"$f":"HLOOKUP(A306,'Courbe In'!$AA$2:$CD$7,6)","v":{"$error":"#VALUE!"}},{"$f":"HLOOKUP(A306,'Courbe In'!$AA$2:$CD$8,7)","v":{"$error":"#VALUE!"}},{"$f":"HLOOKUP(A306,'Courbe In'!$AA$2:$CD$9,8)","v":{"$error":"#VALUE!"}}]
["2021-11-18",null,{"$f":"HLOOKUP(A307,'Courbe In'!$AA$2:$CD$3,2)","v":{"$error":"#VALUE!"}},{"$f":"HLOOKUP(A307,'Courbe In'!$AA$2:$CD$7,5)","v":{"$error":"#VALUE!"}},{"$f":"HLOOKUP(A307,'Courbe In'!$AA$2:$CD$7,4)","v":{"$error":"#VALUE!"}},{"$f":"HLOOKUP(A307,'Courbe In'!$AA$2:$CD$7,6)","v":{"$error":"#VALUE!"}},{"$f":"HLOOKUP(A307,'Courbe In'!$AA$2:$CD$8,7)","v":{"$error":"#VALUE!"}},{"$f":"HLOOKUP(A307,'Courbe In'!$AA$2:$CD$9,8)","v":{"$error":"#VALUE!"}}]
["2021-11-19",null,{"$f":"HLOOKUP(A308,'Courbe In'!$AA$2:$CD$3,2)","v":{"$error":"#VALUE!"}},{"$f":"HLOOKUP(A308,'Courbe In'!$AA$2:$CD$7,5)","v":{"$error":"#VALUE!"}},{"$f":"HLOOKUP(A308,'Courbe In'!$AA$2:$CD$7,4)","v":{"$error":"#VALUE!"}},{"$f":"HLOOKUP(A308,'Courbe In'!$AA$2:$CD$7,6)","v":{"$error":"#VALUE!"}},{"$f":"HLOOKUP(A308,'Courbe In'!$AA$2:$CD$8,7)","v":{"$error":"#VALUE!"}},{"$f":"HLOOKUP(A308,'Courbe In'!$AA$2:$CD$9,8)","v":{"$error":"#VALUE!"}}]
["2021-11-20",null,{"$f":"HLOOKUP(A309,'Courbe In'!$AA$2:$CD$3,2)","v":{"$error":"#VALUE!"}},{"$f":"HLOOKUP(A309,'Courbe In'!$AA$2:$CD$7,5)","v":{"$error":"#VALUE!"}},{"$f":"HLOOKUP(A309,'Courbe In'!$AA$2:$CD$7,4)","v":{"$error":"#VALUE!"}},{"$f":"HLOOKUP(A309,'Courbe In'!$AA$2:$CD$7,6)","v":{"$error":"#VALUE!"}},{"$f":"HLOOKUP(A309,'Courbe In'!$AA$2:$CD$8,7)","v":{"$error":"#VALUE!"}},{"$f":"HLOOKUP(A309,'Courbe In'!$AA$2:$CD$9,8)","v":{"$error":"#VALUE!"}}]
["2021-11-21",null,{"$f":"HLOOKUP(A310,'Courbe In'!$AA$2:$CD$3,2)","v":{"$error":"#VALUE!"}},{"$f":"HLOOKUP(A310,'Courbe In'!$AA$2:$CD$7,5)","v":{"$error":"#VALUE!"}},{"$f":"HLOOKUP(A310,'Courbe In'!$AA$2:$CD$7,4)","v":{"$error":"#VALUE!"}},{"$f":"HLOOKUP(A310,'Courbe In'!$AA$2:$CD$7,6)","v":{"$error":"#VALUE!"}},{"$f":"HLOOKUP(A310,'Courbe In'!$AA$2:$CD$8,7)","v":{"$error":"#VALUE!"}},{"$f":"HLOOKUP(A310,'Courbe In'!$AA$2:$CD$9,8)","v":{"$error":"#VALUE!"}}]
["2021-11-22",null,{"$f":"HLOOKUP(A311,'Courbe In'!$AA$2:$CD$3,2)","v":{"$error":"#VALUE!"}},{"$f":"HLOOKUP(A311,'Courbe In'!$AA$2:$CD$7,5)","v":{"$error":"#VALUE!"}},{"$f":"HLOOKUP(A311,'Courbe In'!$AA$2:$CD$7,4)","v":{"$error":"#VALUE!"}},{"$f":"HLOOKUP(A311,'Courbe In'!$AA$2:$CD$7,6)","v":{"$error":"#VALUE!"}},{"$f":"HLOOKUP(A311,'Courbe In'!$AA$2:$CD$8,7)","v":{"$error":"#VALUE!"}},{"$f":"HLOOKUP(A311,'Courbe In'!$AA$2:$CD$9,8)","v":{"$error":"#VALUE!"}}]
["2021-11-23",null,{"$f":"HLOOKUP(A312,'Courbe In'!$AA$2:$CD$3,2)","v":{"$error":"#VALUE!"}},{"$f":"HLOOKUP(A312,'Courbe In'!$AA$2:$CD$7,5)","v":{"$error":"#VALUE!"}},{"$f":"HLOOKUP(A312,'Courbe In'!$AA$2:$CD$7,4)","v":{"$error":"#VALUE!"}},{"$f":"HLOOKUP(A312,'Courbe In'!$AA$2:$CD$7,6)","v":{"$error":"#VALUE!"}},{"$f":"HLOOKUP(A312,'Courbe In'!$AA$2:$CD$8,7)","v":{"$error":"#VALUE!"}},{"$f":"HLOOKUP(A312,'Courbe In'!$AA$2:$CD$9,8)","v":{"$error":"#VALUE!"}}]
["2021-11-24",null,{"$f":"HLOOKUP(A313,'Courbe In'!$AA$2:$CD$3,2)","v":{"$error":"#VALUE!"}},{"$f":"HLOOKUP(A313,'Courbe In'!$AA$2:$CD$7,5)","v":{"$error":"#VALUE!"}},{"$f":"HLOOKUP(A313,'Courbe In'!$AA$2:$CD$7,4)","v":{"$error":"#VALUE!"}},{"$f":"HLOOKUP(A313,'Courbe In'!$AA$2:$CD$7,6)","v":{"$error":"#VALUE!"}},{"$f":"HLOOKUP(A313,'Courbe In'!$AA$2:$CD$8,7)","v":{"$error":"#VALUE!"}},{"$f":"HLOOKUP(A313,'Courbe In'!$AA$2:$CD$9,8)","v":{"$error":"#VALUE!"}}]
["2021-11-25",null,{"$f":"HLOOKUP(A314,'Courbe In'!$AA$2:$CD$3,2)","v":{"$error":"#VALUE!"}},{"$f":"HLOOKUP(A314,'Courbe In'!$AA$2:$CD$7,5)","v":{"$error":"#VALUE!"}},{"$f":"HLOOKUP(A314,'Courbe In'!$AA$2:$CD$7,4)","v":{"$error":"#VALUE!"}},{"$f":"HLOOKUP(A314,'Courbe In'!$AA$2:$CD$7,6)","v":{"$error":"#VALUE!"}},{"$f":"HLOOKUP(A314,'Courbe In'!$AA$2:$CD$8,7)","v":{"$error":"#VALUE!"}},{"$f":"HLOOKUP(A314,'Courbe In'!$AA$2:$CD$9,8)","v":{"$error":"#VALUE!"}}]
["2021-11-26",null,{"$f":"HLOOKUP(A315,'Courbe In'!$AA$2:$CD$3,2)","v":{"$error":"#VALUE!"}},{"$f":"HLOOKUP(A315,'Courbe In'!$AA$2:$CD$7,5)","v":{"$error":"#VALUE!"}},{"$f":"HLOOKUP(A315,'Courbe In'!$AA$2:$CD$7,4)","v":{"$error":"#VALUE!"}},{"$f":"HLOOKUP(A315,'Courbe In'!$AA$2:$CD$7,6)","v":{"$error":"#VALUE!"}},{"$f":"HLOOKUP(A315,'Courbe In'!$AA$2:$CD$8,7)","v":{"$error":"#VALUE!"}},{"$f":"HLOOKUP(A315,'Courbe In'!$AA$2:$CD$9,8)","v":{"$error":"#VALUE!"}}]
["2021-11-27",null,{"$f":"HLOOKUP(A316,'Courbe In'!$AA$2:$CD$3,2)","v":{"$error":"#VALUE!"}},{"$f":"HLOOKUP(A316,'Courbe In'!$AA$2:$CD$7,5)","v":{"$error":"#VALUE!"}},{"$f":"HLOOKUP(A316,'Courbe In'!$AA$2:$CD$7,4)","v":{"$error":"#VALUE!"}},{"$f":"HLOOKUP(A316,'Courbe In'!$AA$2:$CD$7,6)","v":{"$error":"#VALUE!"}},{"$f":"HLOOKUP(A316,'Courbe In'!$AA$2:$CD$8,7)","v":{"$error":"#VALUE!"}},{"$f":"HLOOKUP(A316,'Courbe In'!$AA$2:$CD$9,8)","v":{"$error":"#VALUE!"}}]
["2021-11-28",null,{"$f":"HLOOKUP(A317,'Courbe In'!$AA$2:$CD$3,2)","v":{"$error":"#VALUE!"}},{"$f":"HLOOKUP(A317,'Courbe In'!$AA$2:$CD$7,5)","v":{"$error":"#VALUE!"}},{"$f":"HLOOKUP(A317,'Courbe In'!$AA$2:$CD$7,4)","v":{"$error":"#VALUE!"}},{"$f":"HLOOKUP(A317,'Courbe In'!$AA$2:$CD$7,6)","v":{"$error":"#VALUE!"}},{"$f":"HLOOKUP(A317,'Courbe In'!$AA$2:$CD$8,7)","v":{"$error":"#VALUE!"}},{"$f":"HLOOKUP(A317,'Courbe In'!$AA$2:$CD$9,8)","v":{"$error":"#VALUE!"}}]
["2021-11-29",null,{"$f":"HLOOKUP(A318,'Courbe In'!$AA$2:$CD$3,2)","v":{"$error":"#VALUE!"}},{"$f":"HLOOKUP(A318,'Courbe In'!$AA$2:$CD$7,5)","v":{"$error":"#VALUE!"}},{"$f":"HLOOKUP(A318,'Courbe In'!$AA$2:$CD$7,4)","v":{"$error":"#VALUE!"}},{"$f":"HLOOKUP(A318,'Courbe In'!$AA$2:$CD$7,6)","v":{"$error":"#VALUE!"}},{"$f":"HLOOKUP(A318,'Courbe In'!$AA$2:$CD$8,7)","v":{"$error":"#VALUE!"}},{"$f":"HLOOKUP(A318,'Courbe In'!$AA$2:$CD$9,8)","v":{"$error":"#VALUE!"}}]
["2021-11-30",null,{"$f":"HLOOKUP(A319,'Courbe In'!$AA$2:$CD$3,2)","v":{"$error":"#VALUE!"}},{"$f":"HLOOKUP(A319,'Courbe In'!$AA$2:$CD$7,5)","v":{"$error":"#VALUE!"}},{"$f":"HLOOKUP(A319,'Courbe In'!$AA$2:$CD$7,4)","v":{"$error":"#VALUE!"}},{"$f":"HLOOKUP(A319,'Courbe In'!$AA$2:$CD$7,6)","v":{"$error":"#VALUE!"}},{"$f":"HLOOKUP(A319,'Courbe In'!$AA$2:$CD$8,7)","v":{"$error":"#VALUE!"}},{"$f":"HLOOKUP(A319,'Courbe In'!$AA$2:$CD$9,8)","v":{"$error":"#VALUE!"}}]
["2021-12-01",null,{"$f":"HLOOKUP(A320,'Courbe In'!$AA$2:$CD$3,2)","v":{"$error":"#VALUE!"}},{"$f":"HLOOKUP(A320,'Courbe In'!$AA$2:$CD$7,5)","v":{"$error":"#VALUE!"}},{"$f":"HLOOKUP(A320,'Courbe In'!$AA$2:$CD$7,4)","v":{"$error":"#VALUE!"}},{"$f":"HLOOKUP(A320,'Courbe In'!$AA$2:$CD$7,6)","v":{"$error":"#VALUE!"}},{"$f":"HLOOKUP(A320,'Courbe In'!$AA$2:$CD$8,7)","v":{"$error":"#VALUE!"}},{"$f":"HLOOKUP(A320,'Courbe In'!$AA$2:$CD$9,8)","v":{"$error":"#VALUE!"}}]
["2021-12-02",null,{"$f":"HLOOKUP(A321,'Courbe In'!$AA$2:$CD$3,2)","v":{"$error":"#VALUE!"}},{"$f":"HLOOKUP(A321,'Courbe In'!$AA$2:$CD$7,5)","v":{"$error":"#VALUE!"}},{"$f":"HLOOKUP(A321,'Courbe In'!$AA$2:$CD$7,4)","v":{"$error":"#VALUE!"}},{"$f":"HLOOKUP(A321,'Courbe In'!$AA$2:$CD$7,6)","v":{"$error":"#VALUE!"}},{"$f":"HLOOKUP(A321,'Courbe In'!$AA$2:$CD$8,7)","v":{"$error":"#VALUE!"}},{"$f":"HLOOKUP(A321,'Courbe In'!$AA$2:$CD$9,8)","v":{"$error":"#VALUE!"}}]
["2021-12-03",null,{"$f":"HLOOKUP(A322,'Courbe In'!$AA$2:$CD$3,2)","v":{"$error":"#VALUE!"}},{"$f":"HLOOKUP(A322,'Courbe In'!$AA$2:$CD$7,5)","v":{"$error":"#VALUE!"}},{"$f":"HLOOKUP(A322,'Courbe In'!$AA$2:$CD$7,4)","v":{"$error":"#VALUE!"}},{"$f":"HLOOKUP(A322,'Courbe In'!$AA$2:$CD$7,6)","v":{"$error":"#VALUE!"}},{"$f":"HLOOKUP(A322,'Courbe In'!$AA$2:$CD$8,7)","v":{"$error":"#VALUE!"}},{"$f":"HLOOKUP(A322,'Courbe In'!$AA$2:$CD$9,8)","v":{"$error":"#VALUE!"}}]
["2021-12-04",null,{"$f":"HLOOKUP(A323,'Courbe In'!$AA$2:$CD$3,2)","v":{"$error":"#VALUE!"}},{"$f":"HLOOKUP(A323,'Courbe In'!$AA$2:$CD$7,5)","v":{"$error":"#VALUE!"}},{"$f":"HLOOKUP(A323,'Courbe In'!$AA$2:$CD$7,4)","v":{"$error":"#VALUE!"}},{"$f":"HLOOKUP(A323,'Courbe In'!$AA$2:$CD$7,6)","v":{"$error":"#VALUE!"}},{"$f":"HLOOKUP(A323,'Courbe In'!$AA$2:$CD$8,7)","v":{"$error":"#VALUE!"}},{"$f":"HLOOKUP(A323,'Courbe In'!$AA$2:$CD$9,8)","v":{"$error":"#VALUE!"}}]
[{"$f":"A323+1","v":"2021-12-05"},null,{"$f":"HLOOKUP(A324,'Courbe In'!$AA$2:$CD$3,2)","v":{"$error":"#VALUE!"}},{"$f":"HLOOKUP(A324,'Courbe In'!$AA$2:$CD$7,5)","v":{"$error":"#VALUE!"}},{"$f":"HLOOKUP(A324,'Courbe In'!$AA$2:$CD$7,4)","v":{"$error":"#VALUE!"}},{"$f":"HLOOKUP(A324,'Courbe In'!$AA$2:$CD$7,6)","v":{"$error":"#VALUE!"}},{"$f":"HLOOKUP(A324,'Courbe In'!$AA$2:$CD$8,7)","v":{"$error":"#VALUE!"}},{"$f":"HLOOKUP(A324,'Courbe In'!$AA$2:$CD$9,8)","v":{"$error":"#VALUE!"}}]
["2021-12-06",null,{"$f":"HLOOKUP(A325,'Courbe In'!$AA$2:$CD$3,2)","v":{"$error":"#VALUE!"}},{"$f":"HLOOKUP(A325,'Courbe In'!$AA$2:$CD$7,5)","v":{"$error":"#VALUE!"}},{"$f":"HLOOKUP(A325,'Courbe In'!$AA$2:$CD$7,4)","v":{"$error":"#VALUE!"}},{"$f":"HLOOKUP(A325,'Courbe In'!$AA$2:$CD$7,6)","v":{"$error":"#VALUE!"}},{"$f":"HLOOKUP(A325,'Courbe In'!$AA$2:$CD$8,7)","v":{"$error":"#VALUE!"}},{"$f":"HLOOKUP(A325,'Courbe In'!$AA$2:$CD$9,8)","v":{"$error":"#VALUE!"}}]
["2021-12-07",null,{"$f":"HLOOKUP(A326,'Courbe In'!$AA$2:$CD$3,2)","v":{"$error":"#VALUE!"}},{"$f":"HLOOKUP(A326,'Courbe In'!$AA$2:$CD$7,5)","v":{"$error":"#VALUE!"}},{"$f":"HLOOKUP(A326,'Courbe In'!$AA$2:$CD$7,4)","v":{"$error":"#VALUE!"}},{"$f":"HLOOKUP(A326,'Courbe In'!$AA$2:$CD$7,6)","v":{"$error":"#VALUE!"}},{"$f":"HLOOKUP(A326,'Courbe In'!$AA$2:$CD$8,7)","v":{"$error":"#VALUE!"}},{"$f":"HLOOKUP(A326,'Courbe In'!$AA$2:$CD$9,8)","v":{"$error":"#VALUE!"}}]
["2021-12-08",null,{"$f":"HLOOKUP(A327,'Courbe In'!$AA$2:$CD$3,2)","v":{"$error":"#VALUE!"}},{"$f":"HLOOKUP(A327,'Courbe In'!$AA$2:$CD$7,5)","v":{"$error":"#VALUE!"}},{"$f":"HLOOKUP(A327,'Courbe In'!$AA$2:$CD$7,4)","v":{"$error":"#VALUE!"}},{"$f":"HLOOKUP(A327,'Courbe In'!$AA$2:$CD$7,6)","v":{"$error":"#VALUE!"}},{"$f":"HLOOKUP(A327,'Courbe In'!$AA$2:$CD$8,7)","v":{"$error":"#VALUE!"}},{"$f":"HLOOKUP(A327,'Courbe In'!$AA$2:$CD$9,8)","v":{"$error":"#VALUE!"}}]
["2021-12-09",null,{"$f":"HLOOKUP(A328,'Courbe In'!$AA$2:$CD$3,2)","v":{"$error":"#VALUE!"}},{"$f":"HLOOKUP(A328,'Courbe In'!$AA$2:$CD$7,5)","v":{"$error":"#VALUE!"}},{"$f":"HLOOKUP(A328,'Courbe In'!$AA$2:$CD$7,4)","v":{"$error":"#VALUE!"}},{"$f":"HLOOKUP(A328,'Courbe In'!$AA$2:$CD$7,6)","v":{"$error":"#VALUE!"}},{"$f":"HLOOKUP(A328,'Courbe In'!$AA$2:$CD$8,7)","v":{"$error":"#VALUE!"}},{"$f":"HLOOKUP(A328,'Courbe In'!$AA$2:$CD$9,8)","v":{"$error":"#VALUE!"}}]
["2021-12-10",null,{"$f":"HLOOKUP(A329,'Courbe In'!$AA$2:$CD$3,2)","v":{"$error":"#VALUE!"}},{"$f":"HLOOKUP(A329,'Courbe In'!$AA$2:$CD$7,5)","v":{"$error":"#VALUE!"}},{"$f":"HLOOKUP(A329,'Courbe In'!$AA$2:$CD$7,4)","v":{"$error":"#VALUE!"}},{"$f":"HLOOKUP(A329,'Courbe In'!$AA$2:$CD$7,6)","v":{"$error":"#VALUE!"}},{"$f":"HLOOKUP(A329,'Courbe In'!$AA$2:$CD$8,7)","v":{"$error":"#VALUE!"}},{"$f":"HLOOKUP(A329,'Courbe In'!$AA$2:$CD$9,8)","v":{"$error":"#VALUE!"}}]
["2021-12-11",null,{"$f":"HLOOKUP(A330,'Courbe In'!$AA$2:$CD$3,2)","v":{"$error":"#VALUE!"}},{"$f":"HLOOKUP(A330,'Courbe In'!$AA$2:$CD$7,5)","v":{"$error":"#VALUE!"}},{"$f":"HLOOKUP(A330,'Courbe In'!$AA$2:$CD$7,4)","v":{"$error":"#VALUE!"}},{"$f":"HLOOKUP(A330,'Courbe In'!$AA$2:$CD$7,6)","v":{"$error":"#VALUE!"}},{"$f":"HLOOKUP(A330,'Courbe In'!$AA$2:$CD$8,7)","v":{"$error":"#VALUE!"}},{"$f":"HLOOKUP(A330,'Courbe In'!$AA$2:$CD$9,8)","v":{"$error":"#VALUE!"}}]
["2021-12-12",null,{"$f":"HLOOKUP(A331,'Courbe In'!$AA$2:$CD$3,2)","v":{"$error":"#VALUE!"}},{"$f":"HLOOKUP(A331,'Courbe In'!$AA$2:$CD$7,5)","v":{"$error":"#VALUE!"}},{"$f":"HLOOKUP(A331,'Courbe In'!$AA$2:$CD$7,4)","v":{"$error":"#VALUE!"}},{"$f":"HLOOKUP(A331,'Courbe In'!$AA$2:$CD$7,6)","v":{"$error":"#VALUE!"}},{"$f":"HLOOKUP(A331,'Courbe In'!$AA$2:$CD$8,7)","v":{"$error":"#VALUE!"}},{"$f":"HLOOKUP(A331,'Courbe In'!$AA$2:$CD$9,8)","v":{"$error":"#VALUE!"}}]
["2021-12-13",null,{"$f":"HLOOKUP(A332,'Courbe In'!$AA$2:$CD$3,2)","v":{"$error":"#VALUE!"}},{"$f":"HLOOKUP(A332,'Courbe In'!$AA$2:$CD$7,5)","v":{"$error":"#VALUE!"}},{"$f":"HLOOKUP(A332,'Courbe In'!$AA$2:$CD$7,4)","v":{"$error":"#VALUE!"}},{"$f":"HLOOKUP(A332,'Courbe In'!$AA$2:$CD$7,6)","v":{"$error":"#VALUE!"}},{"$f":"HLOOKUP(A332,'Courbe In'!$AA$2:$CD$8,7)","v":{"$error":"#VALUE!"}},{"$f":"HLOOKUP(A332,'Courbe In'!$AA$2:$CD$9,8)","v":{"$error":"#VALUE!"}}]
["2021-12-14",null,{"$f":"HLOOKUP(A333,'Courbe In'!$AA$2:$CD$3,2)","v":{"$error":"#VALUE!"}},{"$f":"HLOOKUP(A333,'Courbe In'!$AA$2:$CD$7,5)","v":{"$error":"#VALUE!"}},{"$f":"HLOOKUP(A333,'Courbe In'!$AA$2:$CD$7,4)","v":{"$error":"#VALUE!"}},{"$f":"HLOOKUP(A333,'Courbe In'!$AA$2:$CD$7,6)","v":{"$error":"#VALUE!"}},{"$f":"HLOOKUP(A333,'Courbe In'!$AA$2:$CD$8,7)","v":{"$error":"#VALUE!"}},{"$f":"HLOOKUP(A333,'Courbe In'!$AA$2:$CD$9,8)","v":{"$error":"#VALUE!"}}]
["2021-12-15",null,{"$f":"HLOOKUP(A334,'Courbe In'!$AA$2:$CD$3,2)","v":{"$error":"#VALUE!"}},{"$f":"HLOOKUP(A334,'Courbe In'!$AA$2:$CD$7,5)","v":{"$error":"#VALUE!"}},{"$f":"HLOOKUP(A334,'Courbe In'!$AA$2:$CD$7,4)","v":{"$error":"#VALUE!"}},{"$f":"HLOOKUP(A334,'Courbe In'!$AA$2:$CD$7,6)","v":{"$error":"#VALUE!"}},{"$f":"HLOOKUP(A334,'Courbe In'!$AA$2:$CD$8,7)","v":{"$error":"#VALUE!"}},{"$f":"HLOOKUP(A334,'Courbe In'!$AA$2:$CD$9,8)","v":{"$error":"#VALUE!"}}]
["2021-12-16",null,{"$f":"HLOOKUP(A335,'Courbe In'!$AA$2:$CD$3,2)","v":{"$error":"#VALUE!"}},{"$f":"HLOOKUP(A335,'Courbe In'!$AA$2:$CD$7,5)","v":{"$error":"#VALUE!"}},{"$f":"HLOOKUP(A335,'Courbe In'!$AA$2:$CD$7,4)","v":{"$error":"#VALUE!"}},{"$f":"HLOOKUP(A335,'Courbe In'!$AA$2:$CD$7,6)","v":{"$error":"#VALUE!"}},{"$f":"HLOOKUP(A335,'Courbe In'!$AA$2:$CD$8,7)","v":{"$error":"#VALUE!"}},{"$f":"HLOOKUP(A335,'Courbe In'!$AA$2:$CD$9,8)","v":{"$error":"#VALUE!"}}]
["2021-12-17",null,{"$f":"HLOOKUP(A336,'Courbe In'!$AA$2:$CD$3,2)","v":{"$error":"#VALUE!"}},{"$f":"HLOOKUP(A336,'Courbe In'!$AA$2:$CD$7,5)","v":{"$error":"#VALUE!"}},{"$f":"HLOOKUP(A336,'Courbe In'!$AA$2:$CD$7,4)","v":{"$error":"#VALUE!"}},{"$f":"HLOOKUP(A336,'Courbe In'!$AA$2:$CD$7,6)","v":{"$error":"#VALUE!"}},{"$f":"HLOOKUP(A336,'Courbe In'!$AA$2:$CD$8,7)","v":{"$error":"#VALUE!"}},{"$f":"HLOOKUP(A336,'Courbe In'!$AA$2:$CD$9,8)","v":{"$error":"#VALUE!"}}]
["2021-12-18",null,{"$f":"HLOOKUP(A337,'Courbe In'!$AA$2:$CD$3,2)","v":{"$error":"#VALUE!"}},{"$f":"HLOOKUP(A337,'Courbe In'!$AA$2:$CD$7,5)","v":{"$error":"#VALUE!"}},{"$f":"HLOOKUP(A337,'Courbe In'!$AA$2:$CD$7,4)","v":{"$error":"#VALUE!"}},{"$f":"HLOOKUP(A337,'Courbe In'!$AA$2:$CD$7,6)","v":{"$error":"#VALUE!"}},{"$f":"HLOOKUP(A337,'Courbe In'!$AA$2:$CD$8,7)","v":{"$error":"#VALUE!"}},{"$f":"HLOOKUP(A337,'Courbe In'!$AA$2:$CD$9,8)","v":{"$error":"#VALUE!"}}]
["2021-12-19",null,{"$f":"HLOOKUP(A338,'Courbe In'!$AA$2:$CD$3,2)","v":{"$error":"#VALUE!"}},{"$f":"HLOOKUP(A338,'Courbe In'!$AA$2:$CD$7,5)","v":{"$error":"#VALUE!"}},{"$f":"HLOOKUP(A338,'Courbe In'!$AA$2:$CD$7,4)","v":{"$error":"#VALUE!"}},{"$f":"HLOOKUP(A338,'Courbe In'!$AA$2:$CD$7,6)","v":{"$error":"#VALUE!"}},{"$f":"HLOOKUP(A338,'Courbe In'!$AA$2:$CD$8,7)","v":{"$error":"#VALUE!"}},{"$f":"HLOOKUP(A338,'Courbe In'!$AA$2:$CD$9,8)","v":{"$error":"#VALUE!"}}]
["2021-12-20",null,{"$f":"HLOOKUP(A339,'Courbe In'!$AA$2:$CD$3,2)","v":{"$error":"#VALUE!"}},{"$f":"HLOOKUP(A339,'Courbe In'!$AA$2:$CD$7,5)","v":{"$error":"#VALUE!"}},{"$f":"HLOOKUP(A339,'Courbe In'!$AA$2:$CD$7,4)","v":{"$error":"#VALUE!"}},{"$f":"HLOOKUP(A339,'Courbe In'!$AA$2:$CD$7,6)","v":{"$error":"#VALUE!"}},{"$f":"HLOOKUP(A339,'Courbe In'!$AA$2:$CD$8,7)","v":{"$error":"#VALUE!"}},{"$f":"HLOOKUP(A339,'Courbe In'!$AA$2:$CD$9,8)","v":{"$error":"#VALUE!"}}]
["2021-12-21",null,{"$f":"HLOOKUP(A340,'Courbe In'!$AA$2:$CD$3,2)","v":{"$error":"#VALUE!"}},{"$f":"HLOOKUP(A340,'Courbe In'!$AA$2:$CD$7,5)","v":{"$error":"#VALUE!"}},{"$f":"HLOOKUP(A340,'Courbe In'!$AA$2:$CD$7,4)","v":{"$error":"#VALUE!"}},{"$f":"HLOOKUP(A340,'Courbe In'!$AA$2:$CD$7,6)","v":{"$error":"#VALUE!"}},{"$f":"HLOOKUP(A340,'Courbe In'!$AA$2:$CD$8,7)","v":{"$error":"#VALUE!"}},{"$f":"HLOOKUP(A340,'Courbe In'!$AA$2:$CD$9,8)","v":{"$error":"#VALUE!"}}]
["2021-12-22",null,{"$f":"HLOOKUP(A341,'Courbe In'!$AA$2:$CD$3,2)","v":{"$error":"#VALUE!"}},{"$f":"HLOOKUP(A341,'Courbe In'!$AA$2:$CD$7,5)","v":{"$error":"#VALUE!"}},{"$f":"HLOOKUP(A341,'Courbe In'!$AA$2:$CD$7,4)","v":{"$error":"#VALUE!"}},{"$f":"HLOOKUP(A341,'Courbe In'!$AA$2:$CD$7,6)","v":{"$error":"#VALUE!"}},{"$f":"HLOOKUP(A341,'Courbe In'!$AA$2:$CD$8,7)","v":{"$error":"#VALUE!"}},{"$f":"HLOOKUP(A341,'Courbe In'!$AA$2:$CD$9,8)","v":{"$error":"#VALUE!"}}]
["2021-12-23",null,{"$f":"HLOOKUP(A342,'Courbe In'!$AA$2:$CD$3,2)","v":{"$error":"#VALUE!"}},{"$f":"HLOOKUP(A342,'Courbe In'!$AA$2:$CD$7,5)","v":{"$error":"#VALUE!"}},{"$f":"HLOOKUP(A342,'Courbe In'!$AA$2:$CD$7,4)","v":{"$error":"#VALUE!"}},{"$f":"HLOOKUP(A342,'Courbe In'!$AA$2:$CD$7,6)","v":{"$error":"#VALUE!"}},{"$f":"HLOOKUP(A342,'Courbe In'!$AA$2:$CD$8,7)","v":{"$error":"#VALUE!"}},{"$f":"HLOOKUP(A342,'Courbe In'!$AA$2:$CD$9,8)","v":{"$error":"#VALUE!"}}]
["2021-12-24",null,{"$f":"HLOOKUP(A343,'Courbe In'!$AA$2:$CD$3,2)","v":{"$error":"#VALUE!"}},{"$f":"HLOOKUP(A343,'Courbe In'!$AA$2:$CD$7,5)","v":{"$error":"#VALUE!"}},{"$f":"HLOOKUP(A343,'Courbe In'!$AA$2:$CD$7,4)","v":{"$error":"#VALUE!"}},{"$f":"HLOOKUP(A343,'Courbe In'!$AA$2:$CD$7,6)","v":{"$error":"#VALUE!"}},{"$f":"HLOOKUP(A343,'Courbe In'!$AA$2:$CD$8,7)","v":{"$error":"#VALUE!"}},{"$f":"HLOOKUP(A343,'Courbe In'!$AA$2:$CD$9,8)","v":{"$error":"#VALUE!"}}]
["2021-12-25",null,{"$f":"HLOOKUP(A344,'Courbe In'!$AA$2:$CD$3,2)","v":{"$error":"#VALUE!"}},{"$f":"HLOOKUP(A344,'Courbe In'!$AA$2:$CD$7,5)","v":{"$error":"#VALUE!"}},{"$f":"HLOOKUP(A344,'Courbe In'!$AA$2:$CD$7,4)","v":{"$error":"#VALUE!"}},{"$f":"HLOOKUP(A344,'Courbe In'!$AA$2:$CD$7,6)","v":{"$error":"#VALUE!"}},{"$f":"HLOOKUP(A344,'Courbe In'!$AA$2:$CD$8,7)","v":{"$error":"#VALUE!"}},{"$f":"HLOOKUP(A344,'Courbe In'!$AA$2:$CD$9,8)","v":{"$error":"#VALUE!"}}]
["2021-12-26",null,{"$f":"HLOOKUP(A345,'Courbe In'!$AA$2:$CD$3,2)","v":{"$error":"#VALUE!"}},{"$f":"HLOOKUP(A345,'Courbe In'!$AA$2:$CD$7,5)","v":{"$error":"#VALUE!"}},{"$f":"HLOOKUP(A345,'Courbe In'!$AA$2:$CD$7,4)","v":{"$error":"#VALUE!"}},{"$f":"HLOOKUP(A345,'Courbe In'!$AA$2:$CD$7,6)","v":{"$error":"#VALUE!"}},{"$f":"HLOOKUP(A345,'Courbe In'!$AA$2:$CD$8,7)","v":{"$error":"#VALUE!"}},{"$f":"HLOOKUP(A345,'Courbe In'!$AA$2:$CD$9,8)","v":{"$error":"#VALUE!"}}]
["2021-12-27",null,{"$f":"HLOOKUP(A346,'Courbe In'!$AA$2:$CD$3,2)","v":{"$error":"#VALUE!"}},{"$f":"HLOOKUP(A346,'Courbe In'!$AA$2:$CD$7,5)","v":{"$error":"#VALUE!"}},{"$f":"HLOOKUP(A346,'Courbe In'!$AA$2:$CD$7,4)","v":{"$error":"#VALUE!"}},{"$f":"HLOOKUP(A346,'Courbe In'!$AA$2:$CD$7,6)","v":{"$error":"#VALUE!"}},{"$f":"HLOOKUP(A346,'Courbe In'!$AA$2:$CD$8,7)","v":{"$error":"#VALUE!"}},{"$f":"HLOOKUP(A346,'Courbe In'!$AA$2:$CD$9,8)","v":{"$error":"#VALUE!"}}]
["2021-12-28",null,{"$f":"HLOOKUP(A347,'Courbe In'!$AA$2:$CD$3,2)","v":{"$error":"#VALUE!"}},{"$f":"HLOOKUP(A347,'Courbe In'!$AA$2:$CD$7,5)","v":{"$error":"#VALUE!"}},{"$f":"HLOOKUP(A347,'Courbe In'!$AA$2:$CD$7,4)","v":{"$error":"#VALUE!"}},{"$f":"HLOOKUP(A347,'Courbe In'!$AA$2:$CD$7,6)","v":{"$error":"#VALUE!"}},{"$f":"HLOOKUP(A347,'Courbe In'!$AA$2:$CD$8,7)","v":{"$error":"#VALUE!"}},{"$f":"HLOOKUP(A347,'Courbe In'!$AA$2:$CD$9,8)","v":{"$error":"#VALUE!"}}]
["2021-12-29",null,{"$f":"HLOOKUP(A348,'Courbe In'!$AA$2:$CD$3,2)","v":{"$error":"#VALUE!"}},{"$f":"HLOOKUP(A348,'Courbe In'!$AA$2:$CD$7,5)","v":{"$error":"#VALUE!"}},{"$f":"HLOOKUP(A348,'Courbe In'!$AA$2:$CD$7,4)","v":{"$error":"#VALUE!"}},{"$f":"HLOOKUP(A348,'Courbe In'!$AA$2:$CD$7,6)","v":{"$error":"#VALUE!"}},{"$f":"HLOOKUP(A348,'Courbe In'!$AA$2:$CD$8,7)","v":{"$error":"#VALUE!"}},{"$f":"HLOOKUP(A348,'Courbe In'!$AA$2:$CD$9,8)","v":{"$error":"#VALUE!"}}]
["2021-12-30",null,{"$f":"HLOOKUP(A349,'Courbe In'!$AA$2:$CD$3,2)","v":{"$error":"#VALUE!"}},{"$f":"HLOOKUP(A349,'Courbe In'!$AA$2:$CD$7,5)","v":{"$error":"#VALUE!"}},{"$f":"HLOOKUP(A349,'Courbe In'!$AA$2:$CD$7,4)","v":{"$error":"#VALUE!"}},{"$f":"HLOOKUP(A349,'Courbe In'!$AA$2:$CD$7,6)","v":{"$error":"#VALUE!"}},{"$f":"HLOOKUP(A349,'Courbe In'!$AA$2:$CD$8,7)","v":{"$error":"#VALUE!"}},{"$f":"HLOOKUP(A349,'Courbe In'!$AA$2:$CD$9,8)","v":{"$error":"#VALUE!"}}]
["2021-12-31",null,{"$f":"HLOOKUP(A350,'Courbe In'!$AA$2:$CD$3,2)","v":{"$error":"#VALUE!"}},{"$f":"HLOOKUP(A350,'Courbe In'!$AA$2:$CD$7,5)","v":{"$error":"#VALUE!"}},{"$f":"HLOOKUP(A350,'Courbe In'!$AA$2:$CD$7,4)","v":{"$error":"#VALUE!"}},{"$f":"HLOOKUP(A350,'Courbe In'!$AA$2:$CD$7,6)","v":{"$error":"#VALUE!"}},{"$f":"HLOOKUP(A350,'Courbe In'!$AA$2:$CD$8,7)","v":{"$error":"#VALUE!"}},{"$f":"HLOOKUP(A350,'Courbe In'!$AA$2:$CD$9,8)","v":{"$error":"#VALUE!"}}]
["2022-01-01",null,{"$f":"HLOOKUP(A351,'Courbe In'!$AA$2:$CD$3,2)","v":{"$error":"#VALUE!"}},{"$f":"HLOOKUP(A351,'Courbe In'!$AA$2:$CD$7,5)","v":{"$error":"#VALUE!"}},{"$f":"HLOOKUP(A351,'Courbe In'!$AA$2:$CD$7,4)","v":{"$error":"#VALUE!"}},{"$f":"HLOOKUP(A351,'Courbe In'!$AA$2:$CD$7,6)","v":{"$error":"#VALUE!"}},{"$f":"HLOOKUP(A351,'Courbe In'!$AA$2:$CD$8,7)","v":{"$error":"#VALUE!"}},{"$f":"HLOOKUP(A351,'Courbe In'!$AA$2:$CD$9,8)","v":{"$error":"#VALUE!"}}]
["2022-01-02",null,{"$f":"HLOOKUP(A352,'Courbe In'!$AA$2:$CD$3,2)","v":{"$error":"#VALUE!"}},{"$f":"HLOOKUP(A352,'Courbe In'!$AA$2:$CD$7,5)","v":{"$error":"#VALUE!"}},{"$f":"HLOOKUP(A352,'Courbe In'!$AA$2:$CD$7,4)","v":{"$error":"#VALUE!"}},{"$f":"HLOOKUP(A352,'Courbe In'!$AA$2:$CD$7,6)","v":{"$error":"#VALUE!"}},{"$f":"HLOOKUP(A352,'Courbe In'!$AA$2:$CD$8,7)","v":{"$error":"#VALUE!"}},{"$f":"HLOOKUP(A352,'Courbe In'!$AA$2:$CD$9,8)","v":{"$error":"#VALUE!"}}]
["2022-01-03",null,{"$f":"HLOOKUP(A353,'Courbe In'!$AA$2:$CD$3,2)","v":{"$error":"#VALUE!"}},{"$f":"HLOOKUP(A353,'Courbe In'!$AA$2:$CD$7,5)","v":{"$error":"#VALUE!"}},{"$f":"HLOOKUP(A353,'Courbe In'!$AA$2:$CD$7,4)","v":{"$error":"#VALUE!"}},{"$f":"HLOOKUP(A353,'Courbe In'!$AA$2:$CD$7,6)","v":{"$error":"#VALUE!"}},{"$f":"HLOOKUP(A353,'Courbe In'!$AA$2:$CD$8,7)","v":{"$error":"#VALUE!"}},{"$f":"HLOOKUP(A353,'Courbe In'!$AA$2:$CD$9,8)","v":{"$error":"#VALUE!"}}]
["2022-01-04",null,{"$f":"HLOOKUP(A354,'Courbe In'!$AA$2:$CD$3,2)","v":{"$error":"#VALUE!"}},{"$f":"HLOOKUP(A354,'Courbe In'!$AA$2:$CD$7,5)","v":{"$error":"#VALUE!"}},{"$f":"HLOOKUP(A354,'Courbe In'!$AA$2:$CD$7,4)","v":{"$error":"#VALUE!"}},{"$f":"HLOOKUP(A354,'Courbe In'!$AA$2:$CD$7,6)","v":{"$error":"#VALUE!"}},{"$f":"HLOOKUP(A354,'Courbe In'!$AA$2:$CD$8,7)","v":{"$error":"#VALUE!"}},{"$f":"HLOOKUP(A354,'Courbe In'!$AA$2:$CD$9,8)","v":{"$error":"#VALUE!"}}]
["2022-01-05",null,{"$f":"HLOOKUP(A355,'Courbe In'!$AA$2:$CD$3,2)","v":{"$error":"#VALUE!"}},{"$f":"HLOOKUP(A355,'Courbe In'!$AA$2:$CD$7,5)","v":{"$error":"#VALUE!"}},{"$f":"HLOOKUP(A355,'Courbe In'!$AA$2:$CD$7,4)","v":{"$error":"#VALUE!"}},{"$f":"HLOOKUP(A355,'Courbe In'!$AA$2:$CD$7,6)","v":{"$error":"#VALUE!"}},{"$f":"HLOOKUP(A355,'Courbe In'!$AA$2:$CD$8,7)","v":{"$error":"#VALUE!"}},{"$f":"HLOOKUP(A355,'Courbe In'!$AA$2:$CD$9,8)","v":{"$error":"#VALUE!"}}]
["2022-01-06",null,{"$f":"HLOOKUP(A356,'Courbe In'!$AA$2:$CD$3,2)","v":{"$error":"#VALUE!"}},{"$f":"HLOOKUP(A356,'Courbe In'!$AA$2:$CD$7,5)","v":{"$error":"#VALUE!"}},{"$f":"HLOOKUP(A356,'Courbe In'!$AA$2:$CD$7,4)","v":{"$error":"#VALUE!"}},{"$f":"HLOOKUP(A356,'Courbe In'!$AA$2:$CD$7,6)","v":{"$error":"#VALUE!"}},{"$f":"HLOOKUP(A356,'Courbe In'!$AA$2:$CD$8,7)","v":{"$error":"#VALUE!"}},{"$f":"HLOOKUP(A356,'Courbe In'!$AA$2:$CD$9,8)","v":{"$error":"#VALUE!"}}]
["2022-01-07",null,{"$f":"HLOOKUP(A357,'Courbe In'!$AA$2:$CD$3,2)","v":{"$error":"#VALUE!"}},{"$f":"HLOOKUP(A357,'Courbe In'!$AA$2:$CD$7,5)","v":{"$error":"#VALUE!"}},{"$f":"HLOOKUP(A357,'Courbe In'!$AA$2:$CD$7,4)","v":{"$error":"#VALUE!"}},{"$f":"HLOOKUP(A357,'Courbe In'!$AA$2:$CD$7,6)","v":{"$error":"#VALUE!"}},{"$f":"HLOOKUP(A357,'Courbe In'!$AA$2:$CD$8,7)","v":{"$error":"#VALUE!"}},{"$f":"HLOOKUP(A357,'Courbe In'!$AA$2:$CD$9,8)","v":{"$error":"#VALUE!"}}]
["2022-01-08",null,{"$f":"HLOOKUP(A358,'Courbe In'!$AA$2:$CD$3,2)","v":{"$error":"#VALUE!"}},{"$f":"HLOOKUP(A358,'Courbe In'!$AA$2:$CD$7,5)","v":{"$error":"#VALUE!"}},{"$f":"HLOOKUP(A358,'Courbe In'!$AA$2:$CD$7,4)","v":{"$error":"#VALUE!"}},{"$f":"HLOOKUP(A358,'Courbe In'!$AA$2:$CD$7,6)","v":{"$error":"#VALUE!"}},{"$f":"HLOOKUP(A358,'Courbe In'!$AA$2:$CD$8,7)","v":{"$error":"#VALUE!"}},{"$f":"HLOOKUP(A358,'Courbe In'!$AA$2:$CD$9,8)","v":{"$error":"#VALUE!"}}]
["2022-01-09",null,{"$f":"HLOOKUP(A359,'Courbe In'!$AA$2:$CD$3,2)","v":{"$error":"#VALUE!"}},{"$f":"HLOOKUP(A359,'Courbe In'!$AA$2:$CD$7,5)","v":{"$error":"#VALUE!"}},{"$f":"HLOOKUP(A359,'Courbe In'!$AA$2:$CD$7,4)","v":{"$error":"#VALUE!"}},{"$f":"HLOOKUP(A359,'Courbe In'!$AA$2:$CD$7,6)","v":{"$error":"#VALUE!"}},{"$f":"HLOOKUP(A359,'Courbe In'!$AA$2:$CD$8,7)","v":{"$error":"#VALUE!"}},{"$f":"HLOOKUP(A359,'Courbe In'!$AA$2:$CD$9,8)","v":{"$error":"#VALUE!"}}]
["2022-01-10",null,{"$f":"HLOOKUP(A360,'Courbe In'!$AA$2:$CD$3,2)","v":{"$error":"#VALUE!"}},{"$f":"HLOOKUP(A360,'Courbe In'!$AA$2:$CD$7,5)","v":{"$error":"#VALUE!"}},{"$f":"HLOOKUP(A360,'Courbe In'!$AA$2:$CD$7,4)","v":{"$error":"#VALUE!"}},{"$f":"HLOOKUP(A360,'Courbe In'!$AA$2:$CD$7,6)","v":{"$error":"#VALUE!"}},{"$f":"HLOOKUP(A360,'Courbe In'!$AA$2:$CD$8,7)","v":{"$error":"#VALUE!"}},{"$f":"HLOOKUP(A360,'Courbe In'!$AA$2:$CD$9,8)","v":{"$error":"#VALUE!"}}]
["2022-01-11",null,{"$f":"HLOOKUP(A361,'Courbe In'!$AA$2:$CD$3,2)","v":{"$error":"#VALUE!"}},{"$f":"HLOOKUP(A361,'Courbe In'!$AA$2:$CD$7,5)","v":{"$error":"#VALUE!"}},{"$f":"HLOOKUP(A361,'Courbe In'!$AA$2:$CD$7,4)","v":{"$error":"#VALUE!"}},{"$f":"HLOOKUP(A361,'Courbe In'!$AA$2:$CD$7,6)","v":{"$error":"#VALUE!"}},{"$f":"HLOOKUP(A361,'Courbe In'!$AA$2:$CD$8,7)","v":{"$error":"#VALUE!"}},{"$f":"HLOOKUP(A361,'Courbe In'!$AA$2:$CD$9,8)","v":{"$error":"#VALUE!"}}]
["2022-01-12",null,{"$f":"HLOOKUP(A362,'Courbe In'!$AA$2:$CD$3,2)","v":{"$error":"#VALUE!"}},{"$f":"HLOOKUP(A362,'Courbe In'!$AA$2:$CD$7,5)","v":{"$error":"#VALUE!"}},{"$f":"HLOOKUP(A362,'Courbe In'!$AA$2:$CD$7,4)","v":{"$error":"#VALUE!"}},{"$f":"HLOOKUP(A362,'Courbe In'!$AA$2:$CD$7,6)","v":{"$error":"#VALUE!"}},{"$f":"HLOOKUP(A362,'Courbe In'!$AA$2:$CD$8,7)","v":{"$error":"#VALUE!"}},{"$f":"HLOOKUP(A362,'Courbe In'!$AA$2:$CD$9,8)","v":{"$error":"#VALUE!"}}]
["2022-01-13",null,{"$f":"HLOOKUP(A363,'Courbe In'!$AA$2:$CD$3,2)","v":{"$error":"#VALUE!"}},{"$f":"HLOOKUP(A363,'Courbe In'!$AA$2:$CD$7,5)","v":{"$error":"#VALUE!"}},{"$f":"HLOOKUP(A363,'Courbe In'!$AA$2:$CD$7,4)","v":{"$error":"#VALUE!"}},{"$f":"HLOOKUP(A363,'Courbe In'!$AA$2:$CD$7,6)","v":{"$error":"#VALUE!"}},{"$f":"HLOOKUP(A363,'Courbe In'!$AA$2:$CD$8,7)","v":{"$error":"#VALUE!"}},{"$f":"HLOOKUP(A363,'Courbe In'!$AA$2:$CD$9,8)","v":{"$error":"#VALUE!"}}]
["2022-01-14",null,{"$f":"HLOOKUP(A364,'Courbe In'!$AA$2:$CD$3,2)","v":{"$error":"#VALUE!"}},{"$f":"HLOOKUP(A364,'Courbe In'!$AA$2:$CD$7,5)","v":{"$error":"#VALUE!"}},{"$f":"HLOOKUP(A364,'Courbe In'!$AA$2:$CD$7,4)","v":{"$error":"#VALUE!"}},{"$f":"HLOOKUP(A364,'Courbe In'!$AA$2:$CD$7,6)","v":{"$error":"#VALUE!"}},{"$f":"HLOOKUP(A364,'Courbe In'!$AA$2:$CD$8,7)","v":{"$error":"#VALUE!"}},{"$f":"HLOOKUP(A364,'Courbe In'!$AA$2:$CD$9,8)","v":{"$error":"#VALUE!"}}]
["2022-01-15",null,{"$f":"HLOOKUP(A365,'Courbe In'!$AA$2:$CD$3,2)","v":{"$error":"#VALUE!"}},{"$f":"HLOOKUP(A365,'Courbe In'!$AA$2:$CD$7,5)","v":{"$error":"#VALUE!"}},{"$f":"HLOOKUP(A365,'Courbe In'!$AA$2:$CD$7,4)","v":{"$error":"#VALUE!"}},{"$f":"HLOOKUP(A365,'Courbe In'!$AA$2:$CD$7,6)","v":{"$error":"#VALUE!"}},{"$f":"HLOOKUP(A365,'Courbe In'!$AA$2:$CD$8,7)","v":{"$error":"#VALUE!"}},{"$f":"HLOOKUP(A365,'Courbe In'!$AA$2:$CD$9,8)","v":{"$error":"#VALUE!"}}]
[{"$f":"A365+1","v":"2022-01-16"},null,{"$f":"HLOOKUP(A366,'Courbe In'!$AA$2:$CD$3,2)","v":{"$error":"#VALUE!"}},{"$f":"HLOOKUP(A366,'Courbe In'!$AA$2:$CD$7,5)","v":{"$error":"#VALUE!"}},{"$f":"HLOOKUP(A366,'Courbe In'!$AA$2:$CD$7,4)","v":{"$error":"#VALUE!"}},{"$f":"HLOOKUP(A366,'Courbe In'!$AA$2:$CD$7,6)","v":{"$error":"#VALUE!"}},{"$f":"HLOOKUP(A366,'Courbe In'!$AA$2:$CD$8,7)","v":{"$error":"#VALUE!"}},{"$f":"HLOOKUP(A366,'Courbe In'!$AA$2:$CD$9,8)","v":{"$error":"#VALUE!"}}]
[{"$f":"A366+1","v":"2022-01-17"},null,{"$f":"HLOOKUP(A367,'Courbe In'!$AA$2:$CD$3,2)","v":{"$error":"#VALUE!"}},{"$f":"HLOOKUP(A367,'Courbe In'!$AA$2:$CD$7,5)","v":{"$error":"#VALUE!"}},{"$f":"HLOOKUP(A367,'Courbe In'!$AA$2:$CD$7,4)","v":{"$error":"#VALUE!"}},{"$f":"HLOOKUP(A367,'Courbe In'!$AA$2:$CD$7,6)","v":{"$error":"#VALUE!"}},{"$f":"HLOOKUP(A367,'Courbe In'!$AA$2:$CD$8,7)","v":{"$error":"#VALUE!"}},{"$f":"HLOOKUP(A367,'Courbe In'!$AA$2:$CD$9,8)","v":{"$error":"#VALUE!"}}]

{"sheet":"Saisie Pds","index":27,"n_rows":64,"n_cols":15,"rows_kept":64,"cut":false,"hidden":false,"merged":[[15,1,17,2]]}
[]
[]
[null,"  Date","  Modifier la date",null,null,null,null,null,null,null,null,null,null,null,{"$f":"VLOOKUP($L$5-2,Feuil1!$A$2:'Feuil1'!$B$366,2)","v":{"$error":"#N/A"}}]
[null,{"$f":"NOW()","v":"2021-01-17T16:05:21.520"},1,null,null,1,{"$f":"B4","v":"2021-01-17T16:05:21.520"},{"$f":"VLOOKUP(C4,F4:G64,2)","v":"2021-01-17T16:05:21.520"},null,null,null,null,null,null,{"$f":"VLOOKUP($L$5-1,Feuil1!$A$2:'Feuil1'!$B$366,2)","v":{"$error":"#N/A"}}]
[null,null,null,null,null,2,{"$f":"G4-1","v":"2021-01-16T16:05:21.520"},{"$f":"SUM(H4-Accueil!B3+1)","v":1.6703879629640142},null,null,{"$f":"B4","v":44213.670387962964},{"$f":"K5-28","v":44185.670387962964},{"$f":"MAX(O3:O7)","v":{"$error":"#N/A"}},null,{"$f":"VLOOKUP($L$5,Feuil1!$A$2:'Feuil1'!$B$366,2)","v":{"$error":"#N/A"}}]
[null,"Entrer le poids de ce jour",null,null,null,3,{"$f":"G5-1","v":"2021-01-15T16:05:21.520"},null,null,null,{"$f":"IF(M5=0,\"NC\",M5)","v":{"$error":"#N/A"}},{"$f":"IF(K6=\"NC\",\"NC\",B7-K6)","v":{"$error":"#N/A"}},null,null,{"$f":"VLOOKUP($L$5+1,Feuil1!$A$2:'Feuil1'!$B$366,2)","v":{"$error":"#N/A"}}]
[{"$f":"IF(T(B7)=\"\",1,0)","v":1},null," kg",null,null,4,"2021-01-14T16:05:21.520",null,null,null,null,null,null,null,{"$f":"VLOOKUP($L$5+2,Feuil1!$A$2:'Feuil1'!$B$366,2)","v":{"$error":"#N/A"}}]
[null,{"$f":"SEARCH(\".\",B7)","v":{"$error":"#VALUE!"}},null,null,null,5,"2021-01-13T16:05:21.520"]
[null,{"$f":"LEFT(B7,B8-1)","v":{"$error":"#VALUE!"}},null,null,null,6,"2021-01-12T16:05:21.520"]
[null,{"$f":"VALUE(B9)","v":{"$error":"#VALUE!"}},null,null,null,7,"2021-01-11T16:05:21.520"]
[null,{"$f":"LEN(B7)","v":0},null,null,null,8,"2021-01-10T16:05:21.520"]
[null,{"$f":"RIGHT(B7,B11-B8)","v":{"$error":"#VALUE!"}},null,null,null,9,"2021-01-09T16:05:21.520"]
[null,{"$f":"VALUE(B12)/(10*(B11-B8))","v":{"$error":"#VALUE!"}},null,null,null,10,"2021-01-08T16:05:21.520"]
[null,{"$f":"B9+B13","v":{"$error":"#VALUE!"}},null,null,null,11,"2021-01-07T16:05:21.520"]
[null,null,null,null,null,12,"2021-01-06T16:05:21.520"]
[null,"Variation du poids sur 4 semaines :",null,null,null,13,"2021-01-05T16:05:21.520"]
[null,null,null,{"$f":"IFERROR(IF(L6=\"NC\",\"non valide\",L6),\"pas encore disponible\")","v":"pas encore disponible"},{"$f":"IF(ISNUMBER(D17),\"KG\",\"\")","v":""},14,"2021-01-04T16:05:21.520"]
[null,null,null,null,null,15,"2021-01-03T16:05:21.520"]
[null,null,null,null,null,16,"2021-01-02T16:05:21.520"]
[null,null,null,null,null,17,"2021-01-01T16:05:21.520"]
[null,null,null,null,null,18,"2020-12-31T16:05:21.520"]
[null,null,null,null,null,19,"2020-12-30T16:05:21.520"]
[null,null,null,null,null,20,"2020-12-29T16:05:21.520"]
[null,null,null,null,null,21,"2020-12-28T16:05:21.520"]
[null,null,null,null,null,22,"2020-12-27T16:05:21.520"]
[null,null,null,null,null,23,"2020-12-26T16:05:21.520"]
[null,null,null,null,null,24,"2020-12-25T16:05:21.520"]
[null,null,null,null,null,25,"2020-12-24T16:05:21.520"]
[null,null,null,null,null,26,"2020-12-23T16:05:21.520"]
[null,null,null,null,null,27,"2020-12-22T16:05:21.520"]
[null,null,null,null,null,28,"2020-12-21T16:05:21.520"]
[null,null,null,null,null,29,"2020-12-20T16:05:21.520"]
[null,null,null,null,null,30,"2020-12-19T16:05:21.520"]
[null,null,null,null,null,31,"2020-12-18T16:05:21.520"]
[null,null,null,null,null,32,"2020-12-17T16:05:21.520"]
[null,null,null,null,null,33,"2020-12-16T16:05:21.520"]
[null,null,null,null,null,34,"2020-12-15T16:05:21.520"]
[null,null,null,null,null,35,"2020-12-14T16:05:21.520"]
[null,null,null,null,null,36,"2020-12-13T16:05:21.520"]
[null,null,null,null,null,37,"2020-12-12T16:05:21.520"]
[null,null,null,null,null,38,"2020-12-11T16:05:21.520"]
[null,null,null,null,null,39,"2020-12-10T16:05:21.520"]
[null,null,null,null,null,40,"2020-12-09T16:05:21.520"]
[null,null,null,null,null,41,"2020-12-08T16:05:21.520"]
[null,null,null,null,null,42,"2020-12-07T16:05:21.520"]
[null,null,null,null,null,43,"2020-12-06T16:05:21.520"]
[null,null,null,null,null,44,"2020-12-05T16:05:21.520"]
[null,null,null,null,null,45,"2020-12-04T16:05:21.520"]
[null,null,null,null,null,46,"2020-12-03T16:05:21.520"]
[null,null,null,null,null,47,"2020-12-02T16:05:21.520"]
[null,null,null,null,null,48,"2020-12-01T16:05:21.520"]
[null,null,null,null,null,49,"2020-11-30T16:05:21.520"]
[null,null,null,null,null,50,"2020-11-29T16:05:21.520"]
[null,null,null,null,null,51,"2020-11-28T16:05:21.520"]
[null,null,null,null,null,52,"2020-11-27T16:05:21.520"]
[null,null,null,null,null,53,"2020-11-26T16:05:21.520"]
[null,null,null,null,null,54,"2020-11-25T16:05:21.520"]
[null,null,null,null,null,55,"2020-11-24T16:05:21.520"]
[null,null,null,null,null,56,"2020-11-23T16:05:21.520"]
[null,null,null,null,null,57,"2020-11-22T16:05:21.520"]
[null,null,null,null,null,58,"2020-11-21T16:05:21.520"]
[null,null,null,null,null,59,"2020-11-20T16:05:21.520"]
[null,null,null,null,null,60,"2020-11-19T16:05:21.520"]
[null,null,null,null,null,61,"2020-11-18T16:05:21.520"]

{"sheet":"IDC","index":28,"n_rows":37,"n_cols":23,"rows_kept":37,"cut":false,"hidden":false,"merged":[[0,1,0,4],[1,0,1,12]]}
[null,"Image du corps"]
["Cocher pour chaque ligne la case correspondant le mieux à votre appréciation personnelle de votre image corporelle et notez de 1 à 6 l'importance que vous y attachez."]
[null,null,"J'aime beaucoup","J'aime bien","J'aime un peu","Je n'aime pas vraiment","Je n'aime pas","Je déteste","Importance"]
[1,"Ma silhouette générale",null,null,null,null,null,null,null,{"$f":"IF(M4>I$26,1,0)","v":0},null,{"$f":"IF(J4*K4>4,\"!\",\"\")","v":""},{"$f":"IF(ISBLANK(N4),\"\",N4-1)","v":""},null,{"$f":"IF(ISBLANK(K4),0,IF(ISBLANK(N4),0,1))","v":0}]
[2,"Mes cheveux",null,null,null,null,null,null,null,{"$f":"IF(M5>I$26,1,0)","v":0},null,{"$f":"IF(J5*K5>4,\"!\",\"\")","v":""},{"$f":"IF(ISBLANK(N5),\"\",N5-1)","v":""},null,{"$f":"IF(ISBLANK(K5),0,IF(ISBLANK(N5),0,1))","v":0}]
[3,"Mon visage",null,null,null,null,null,null,null,0,null,"","",null,0]
[4,"Mes yeux",null,null,null,null,null,null,null,0,null,"","",null,0]
[5,"Mon nez",null,null,null,null,null,null,null,0,null,"","",null,0]
[6,"Ma bouche",null,null,null,null,null,null,null,0,null,"","",null,0]
[7,"Mon cou",null,null,null,null,null,null,null,0,null,"","",null,0]
[8,"Mes épaules",null,null,null,null,null,null,null,0,null,"","",null,0]
[9,"Mes bras",null,null,null,null,null,null,null,0,null,"","",null,0]
[10,"Mes avant-bras",null,null,null,null,null,null,null,0,null,"","",null,0]
[11,"Mes mains",null,null,null,null,null,null,null,0,null,"","",null,0]
[12,"Mon dos",null,null,null,null,null,null,null,0,null,"","",null,0]
[13,"Ma poitrine",null,null,null,null,null,null,null,0,null,"","",null,0]
[14,"Mes hanches",null,null,null,null,null,null,null,0,null,"","",null,0]
[15,"Mon ventre",null,null,null,null,null,null,null,0,null,"","",null,0]
[16,"Mes fesses",null,null,null,null,null,null,null,0,null,"","",null,0]
[17,"Mes cuisses",null,null,null,null,null,null,null,0,null,"","",null,0]
[18,"Mes genoux",null,null,null,null,null,null,null,0,null,"","",null,0]
[19,"Mes mollets",null,null,null,null,null,null,null,0,null,"","",null,0]
[20,"Mes pieds",null,null,null,null,null,null,null,0,null,"","",null,0]
[21,"L'aspect de ma peau",null,null,null,null,null,null,null,0,null,"","",null,0]
[22,"Ma musculature",null,null,null,null,null,null,null,0,null,"","",null,0]
[null,null,null,null,null,null,null,"MOYENNE",{"$f":"IF(N25=\"\",\"\",AVERAGEA(M4:M25))","v":""},null,null,null,null,null,{"$f":"SUM(O4:O25)","v":0}]
[]
[]
[]
[]
[]
[]
[]
[]
[null,"Silhouette","Cheveux","Visage","Yeux","Nez","Bouche","Cou","Epaules","Bras","Avant-bras","Mains","Dos","Poitrine","Hanches","Ventre","Fesses","Cuisses","Genoux","Mollets","Pieds","Peau","Musculature"]
["Importance",{"$f":"M4","v":""},{"$f":"M5","v":""},{"$f":"M6","v":""},{"$f":"M7","v":""},{"$f":"M8","v":""},{"$f":"M9","v":""},{"$f":"M10","v":""},{"$f":"M11","v":""},{"$f":"M12","v":""},{"$f":"M13","v":""},{"$f":"M14","v":""},{"$f":"M15","v":""},{"$f":"M16","v":""},{"$f":"M17","v":""},{"$f":"M18","v":""},{"$f":"M19","v":""},{"$f":"M20","v":""},{"$f":"M21","v":""},{"$f":"M22","v":""},{"$f":"M23","v":""},{"$f":"M24","v":""},{"$f":"M25","v":""}]
["Valence",{"$f":"K4","v":0},{"$f":"K5","v":0},{"$f":"K6","v":0},{"$f":"K7","v":0},{"$f":"K8","v":0},{"$f":"K9","v":0},{"$f":"K10","v":0},{"$f":"K11","v":0},{"$f":"K12","v":0},{"$f":"K13","v":0},{"$f":"K14","v":0},{"$f":"K15","v":0},{"$f":"K16","v":0},{"$f":"K17","v":0},{"$f":"K18","v":0},{"$f":"K19","v":0},{"$f":"K20","v":0},{"$f":"K21","v":0},{"$f":"K22","v":0},{"$f":"K23","v":0},{"$f":"K24","v":0},{"$f":"K25","v":0}]

{"sheet":"Graph IDC","index":29,"n_rows":0,"n_cols":0,"rows_kept":0,"cut":false,"hidden":false,"merged":[]}